Re: [VOTE] Release Qpid Dispatch Router 1.8.0 (RC1)

classic Classic list List threaded Threaded
9 messages Options
Reply | Threaded
Open this post in threaded view
|

Re: [VOTE] Release Qpid Dispatch Router 1.8.0 (RC1)

Gordon Sim
On 07/06/2019 4:23 pm, Ganesh Murthy wrote:
> Hello All,
>           Please cast your vote on this thread to release RC1 as the
> official Qpid Dispatch Router version  1.8.0.
>
> RC1 of Qpid Dispatch Router version 1.8.0 can be found here:
>
> https://dist.apache.org/repos/dist/dev/qpid/dispatch/1.8.0-rc1/

+1, verified signature and checksum, built from source ran all tests
(hit failures on fallback and edge router tests on first run but was
then unable to reproduce those) and installed, ran relevant python
proton and qpid:messaging c++ examples against it, ran it through CI for
enmasse.io

---------------------------------------------------------------------
To unsubscribe, e-mail: [hidden email]
For additional commands, e-mail: [hidden email]

Reply | Threaded
Open this post in threaded view
|

Re: [VOTE] Release Qpid Dispatch Router 1.8.0 (RC1)

Michael Goulish
*  -1*


I built against latest released proton  ( 0.28.0 ) and I am running on a
new clean-install of Fedora 30.

I have two test failures.

I imagine that the 100% authz failure is because I do not have something
installed, but there were no warnings from cmake.


Here's the output:



97% tests passed, 2 tests failed out of 58

Total Test time (real) = 841.96 sec

The following tests FAILED:
         39 - system_tests_authz_service_plugin (Failed)
         52 - system_tests_http (Failed)






test 39
      Start 39: system_tests_authz_service_plugin

39: Test command: /usr/bin/python
"/home/mick/latest/qpid-dispatch-1.8.0/build/tests/run.py" "unit2" "-v"
"system_tests_authz_service_plugin"
39: Test timeout computed to be: 1500
39: test_authorized
(system_tests_authz_service_plugin.AuthServicePluginAuthzDeprecatedTest)
... FAIL
39: test_dynamic_source_anonymous_sender
(system_tests_authz_service_plugin.AuthServicePluginAuthzDeprecatedTest)
... FAIL
39: test_unauthorized
(system_tests_authz_service_plugin.AuthServicePluginAuthzDeprecatedTest)
... FAIL
39: test_unauthorized_anonymous_sender_target
(system_tests_authz_service_plugin.AuthServicePluginAuthzDeprecatedTest)
... FAIL
39: test_wildcard
(system_tests_authz_service_plugin.AuthServicePluginAuthzDeprecatedTest)
... FAIL
39: test_authorized
(system_tests_authz_service_plugin.AuthServicePluginAuthzTest) ... FAIL
39: test_dynamic_source_anonymous_sender
(system_tests_authz_service_plugin.AuthServicePluginAuthzTest) ... FAIL
39: test_unauthorized
(system_tests_authz_service_plugin.AuthServicePluginAuthzTest) ... FAIL
39: test_unauthorized_anonymous_sender_target
(system_tests_authz_service_plugin.AuthServicePluginAuthzTest) ... FAIL
39: test_wildcard
(system_tests_authz_service_plugin.AuthServicePluginAuthzTest) ... FAIL
39:  ..... and so on .





52: test_https_get (system_tests_http.RouterTestHttp) ... ERROR
52: ERROR
52: test_listen_error (system_tests_http.RouterTestHttp)
52: Make sure a router exits if an initial HTTP listener fails, doesn't
hang ... ok
52:
52: ======================================================================
52: ERROR: test_https_get (system_tests_http.RouterTestHttp)
52: ----------------------------------------------------------------------
52: Traceback (most recent call last):
52:   File
"/home/mick/latest/qpid-dispatch-1.8.0/tests/system_tests_http.py", line
252, in test_https_get
52:     self.assert_get("<a href="http://localhost:%s">http://localhost:%s" % r.ports[0])
52:   File
"/home/mick/latest/qpid-dispatch-1.8.0/tests/system_tests_http.py", line
83, in assert_get
52:     self.assertEqual(u'HTTP test\n',
self.get("%s/system_tests_http.txt" % url))
52:   File
"/home/mick/latest/qpid-dispatch-1.8.0/tests/system_tests_http.py", line
54, in get
52:     http_data = urlopen(url, cafile=cls.ssl_file('ca-certificate.pem'))
52:   File "/usr/lib64/python2.7/urllib2.py", line 154, in urlopen
52:     return opener.open(url, data, timeout)
52:   File "/usr/lib64/python2.7/urllib2.py", line 429, in open
52:     response = self._open(req, data)
52:   File "/usr/lib64/python2.7/urllib2.py", line 447, in _open
52:     '_open', req)
52:   File "/usr/lib64/python2.7/urllib2.py", line 407, in _call_chain
52:     result = func(*args)
52:   File "/usr/lib64/python2.7/urllib2.py", line 1230, in http_open
52:     return self.do_open(httplib.HTTPConnection, req)
52:   File "/usr/lib64/python2.7/urllib2.py", line 1203, in do_open
52:     r = h.getresponse(buffering=True)
52:   File "/usr/lib64/python2.7/httplib.py", line 1121, in getresponse
52:     response.begin()
52:   File "/usr/lib64/python2.7/httplib.py", line 438, in begin
52:     version, status, reason = self._read_status()
52:   File "/usr/lib64/python2.7/httplib.py", line 394, in _read_status
52:     line = self.fp.readline(_MAXLINE + 1)
52:   File "/usr/lib64/python2.7/socket.py", line 480, in readline
52:     data = self._sock.recv(self._rbufsize)
52: socket.error: [Errno 104] Connection reset by peer
52:
52: ======================================================================


52: RuntimeError: Errors during teardown:
52:
52: Process 10637 error: exit code -11, expected -1
52: qdrouterd -c https-test-router.conf -I
/home/mick/latest/qpid-dispatch-1.8.0/python
52:
/home/mick/latest/qpid-dispatch-1.8.0/build/tests/system_test.dir/system_tests_http/RouterTestHttp/test_https_get/https-test-router-5.cmd
Reply | Threaded
Open this post in threaded view
|

Re: [VOTE] Release Qpid Dispatch Router 1.8.0 (RC1)

Michael Goulish
My version of libwebsockets is 3.1.0-2, which is the version with a known
crash here  (Gordon pointed out), but then we should detect that and skip
the test, rather than show a failure.

And this leaves the authz failure -- which could be due to some missing
package, except that the build system should detect those & throw a warning
so I have some way to fix.



On Tue, Jun 11, 2019 at 8:12 AM Michael Goulish <[hidden email]> wrote:

>
> *  -1*
>
>
> I built against latest released proton  ( 0.28.0 ) and I am running on a
> new clean-install of Fedora 30.
>
> I have two test failures.
>
> I imagine that the 100% authz failure is because I do not have something
> installed, but there were no warnings from cmake.
>
>
> Here's the output:
>
>
>
> 97% tests passed, 2 tests failed out of 58
>
> Total Test time (real) = 841.96 sec
>
> The following tests FAILED:
>          39 - system_tests_authz_service_plugin (Failed)
>          52 - system_tests_http (Failed)
>
>
>
>
>
>
> test 39
>       Start 39: system_tests_authz_service_plugin
>
> 39: Test command: /usr/bin/python
> "/home/mick/latest/qpid-dispatch-1.8.0/build/tests/run.py" "unit2" "-v"
> "system_tests_authz_service_plugin"
> 39: Test timeout computed to be: 1500
> 39: test_authorized
> (system_tests_authz_service_plugin.AuthServicePluginAuthzDeprecatedTest)
> ... FAIL
> 39: test_dynamic_source_anonymous_sender
> (system_tests_authz_service_plugin.AuthServicePluginAuthzDeprecatedTest)
> ... FAIL
> 39: test_unauthorized
> (system_tests_authz_service_plugin.AuthServicePluginAuthzDeprecatedTest)
> ... FAIL
> 39: test_unauthorized_anonymous_sender_target
> (system_tests_authz_service_plugin.AuthServicePluginAuthzDeprecatedTest)
> ... FAIL
> 39: test_wildcard
> (system_tests_authz_service_plugin.AuthServicePluginAuthzDeprecatedTest)
> ... FAIL
> 39: test_authorized
> (system_tests_authz_service_plugin.AuthServicePluginAuthzTest) ... FAIL
> 39: test_dynamic_source_anonymous_sender
> (system_tests_authz_service_plugin.AuthServicePluginAuthzTest) ... FAIL
> 39: test_unauthorized
> (system_tests_authz_service_plugin.AuthServicePluginAuthzTest) ... FAIL
> 39: test_unauthorized_anonymous_sender_target
> (system_tests_authz_service_plugin.AuthServicePluginAuthzTest) ... FAIL
> 39: test_wildcard
> (system_tests_authz_service_plugin.AuthServicePluginAuthzTest) ... FAIL
> 39:  ..... and so on .
>
>
>
>
>
> 52: test_https_get (system_tests_http.RouterTestHttp) ... ERROR
> 52: ERROR
> 52: test_listen_error (system_tests_http.RouterTestHttp)
> 52: Make sure a router exits if an initial HTTP listener fails, doesn't
> hang ... ok
> 52:
> 52: ======================================================================
> 52: ERROR: test_https_get (system_tests_http.RouterTestHttp)
> 52: ----------------------------------------------------------------------
> 52: Traceback (most recent call last):
> 52:   File
> "/home/mick/latest/qpid-dispatch-1.8.0/tests/system_tests_http.py", line
> 252, in test_https_get
> 52:     self.assert_get("<a href="http://localhost:%s">http://localhost:%s" % r.ports[0])
> 52:   File
> "/home/mick/latest/qpid-dispatch-1.8.0/tests/system_tests_http.py", line
> 83, in assert_get
> 52:     self.assertEqual(u'HTTP test\n',
> self.get("%s/system_tests_http.txt" % url))
> 52:   File
> "/home/mick/latest/qpid-dispatch-1.8.0/tests/system_tests_http.py", line
> 54, in get
> 52:     http_data = urlopen(url, cafile=cls.ssl_file('ca-certificate.pem'))
> 52:   File "/usr/lib64/python2.7/urllib2.py", line 154, in urlopen
> 52:     return opener.open(url, data, timeout)
> 52:   File "/usr/lib64/python2.7/urllib2.py", line 429, in open
> 52:     response = self._open(req, data)
> 52:   File "/usr/lib64/python2.7/urllib2.py", line 447, in _open
> 52:     '_open', req)
> 52:   File "/usr/lib64/python2.7/urllib2.py", line 407, in _call_chain
> 52:     result = func(*args)
> 52:   File "/usr/lib64/python2.7/urllib2.py", line 1230, in http_open
> 52:     return self.do_open(httplib.HTTPConnection, req)
> 52:   File "/usr/lib64/python2.7/urllib2.py", line 1203, in do_open
> 52:     r = h.getresponse(buffering=True)
> 52:   File "/usr/lib64/python2.7/httplib.py", line 1121, in getresponse
> 52:     response.begin()
> 52:   File "/usr/lib64/python2.7/httplib.py", line 438, in begin
> 52:     version, status, reason = self._read_status()
> 52:   File "/usr/lib64/python2.7/httplib.py", line 394, in _read_status
> 52:     line = self.fp.readline(_MAXLINE + 1)
> 52:   File "/usr/lib64/python2.7/socket.py", line 480, in readline
> 52:     data = self._sock.recv(self._rbufsize)
> 52: socket.error: [Errno 104] Connection reset by peer
> 52:
> 52: ======================================================================
>
>
> 52: RuntimeError: Errors during teardown:
> 52:
> 52: Process 10637 error: exit code -11, expected -1
> 52: qdrouterd -c https-test-router.conf -I
> /home/mick/latest/qpid-dispatch-1.8.0/python
> 52:
> /home/mick/latest/qpid-dispatch-1.8.0/build/tests/system_test.dir/system_tests_http/RouterTestHttp/test_https_get/https-test-router-5.cmd
>
>
>
>
>
Reply | Threaded
Open this post in threaded view
|

Re: [VOTE] Release Qpid Dispatch Router 1.8.0 (RC1)

Gordon Sim
On 11/06/2019 3:56 pm, Michael Goulish wrote:
> My version of libwebsockets is 3.1.0-2, which is the version with a known
> crash here  (Gordon pointed out), but then we should detect that and skip
> the test, rather than show a failure.
>
> And this leaves the authz failure -- which could be due to some missing
> package, except that the build system should detect those & throw a warning
> so I have some way to fix.

Agreed that both those suggestions would be nice improvements. The
libwebsockets issue is not a blocker though. I suspect you are right
about the root cause of the authz failures but it would be nice to try
and track those down. If so they also would not be blockers for the
release.

---------------------------------------------------------------------
To unsubscribe, e-mail: [hidden email]
For additional commands, e-mail: [hidden email]

Reply | Threaded
Open this post in threaded view
|

Re: [VOTE] Release Qpid Dispatch Router 1.8.0 (RC1)

Ganesh Murthy
On Tue, Jun 11, 2019 at 11:01 AM Gordon Sim <[hidden email]> wrote:

> On 11/06/2019 3:56 pm, Michael Goulish wrote:
> > My version of libwebsockets is 3.1.0-2, which is the version with a known
> > crash here  (Gordon pointed out), but then we should detect that and skip
> > the test, rather than show a failure.
> >
> > And this leaves the authz failure -- which could be due to some missing
> > package, except that the build system should detect those & throw a
> warning
> > so I have some way to fix.
>
> Agreed that both those suggestions would be nice improvements. The
> libwebsockets issue is not a blocker though. I suspect you are right
> about the root cause of the authz failures but it would be nice to try
> and track those down. If so they also would not be blockers for the
> release.
>
Hi Mick,
    Based on Gordon's response, would you consider changing your vote to a
+1 ?
Thanks.

>
> ---------------------------------------------------------------------
> To unsubscribe, e-mail: [hidden email]
> For additional commands, e-mail: [hidden email]
>
>
Reply | Threaded
Open this post in threaded view
|

Re: [VOTE] Release Qpid Dispatch Router 1.8.0 (RC1)

Chuck Rolke
In reply to this post by Gordon Sim
+1

* Checked checksums
* Build/test Fedora 29, python 3
  * Fails system_tests_http (known problem, not a regression)
* Build/test Fedora 28, python 2
  * Occasional test fail system_tests_fallback_dest
    known problem in new test code and not in mission code; fix is already on master; not a regression


----- Original Message -----

> From: "Ganesh Murthy" <[hidden email]>
> To: [hidden email], [hidden email]
> Sent: Friday, June 7, 2019 11:23:40 AM
> Subject: [VOTE] Release Qpid Dispatch Router 1.8.0 (RC1)
>
> Hello All,
>          Please cast your vote on this thread to release RC1 as the
> official Qpid Dispatch Router version  1.8.0.
>
> RC1 of Qpid Dispatch Router version 1.8.0 can be found here:
>
> https://dist.apache.org/repos/dist/dev/qpid/dispatch/1.8.0-rc1/
>
> The following features, improvements, and bug fixes are introduced in 1.8.0:
>
> Features -
>    DISPATCH-1337 - Fallback Destination for Unreachable Addresses
>
> Improvements -
>     DISPATCH-1308 - Console access to the force-close a connection feature
>     DISPATCH-1320 - Make it easier to use separate logos for upstream
> and downstream masthead
>     DISPATCH-1321 - Set rpath for qpid-proton (and other dependencies)
> when they are found in nonstandard location
>     DISPATCH-1329 - Edge router system test needs skip test convenience
>     switches
>     DISPATCH-1340 - Show settlement rate and delayed deliveries in client
>     popup
>     DISPATCH-1341 - Add list of delayed links to console's overview page
>     DISPATCH-1348 - Avoid qdr_error_t allocation if not necessary
>     DISPATCH-1356 - Remove the dotted line around routers that
> indicates the router is fixed.
>     DISPATCH-1357 - Change the name of the 'Kill' feature to 'Close'
>
> Bug fixes -
>     DISPATCH-974 - Getting connections via the router management
> protocol causes AMQP framing errors
>     DISPATCH-1230 - System test failing with OpenSSL >= 1.1 -
>     system_tests_ssl
>     DISPATCH-1312 - Remove cmake option USE_MEMORY_POOL
>     DISPATCH-1317 - HTTP system test is failing on python2.6
>     DISPATCH-1318 - edge_router system test failing
>     DISPATCH-1322 - Edge router drops disposition when remote receiver closes
>     DISPATCH-1323 - Deprecate addr and externalAddr attributes of
> autoLink entity. Add address and externalAddress instead.
>     DISPATCH-1324 - [tools] Scraper uses deprecated cgi.escape function
>     DISPATCH-1325 - Sender connections to edge router that connect
> 'too soon' never get credit
>     DISPATCH-1326 - Anonymous messages are released by edge router
> even if there is a receiver for the messages
>     DISPATCH-1330 - Q2 stall due to incorrect msg buffer ref count
> decrement on link detach
>     DISPATCH-1334 - Background map on topology page incorrect height
>     DISPATCH-1335 - After adding client, topology page shows new icon
> in upper-left corner
>     DISPATCH-1339 - Multiple consoles attached to a router are showing
> as separate icons
>
>
> Thanks.
>
> ---------------------------------------------------------------------
> To unsubscribe, e-mail: [hidden email]
> For additional commands, e-mail: [hidden email]
>
>

---------------------------------------------------------------------
To unsubscribe, e-mail: [hidden email]
For additional commands, e-mail: [hidden email]

Reply | Threaded
Open this post in threaded view
|

Re: [VOTE] Release Qpid Dispatch Router 1.8.0 (RC1)

Gordon Sim
In reply to this post by Michael Goulish
On 11/06/2019 3:56 pm, Michael Goulish wrote:
> And this leaves the authz failure -- which could be due to some missing
> package, except that the build system should detect those & throw a warning
> so I have some way to fix.

You can get more information about the test failures from the various
logs under
tests/system_test.dir/system_tests_authz_service_plugin/AuthServicePluginAuthzTest/
especially setUpClass/

What cyrus-sasl plugins do you have under /usr/lib64/sasl2/? Though
given that the auth  plugin tests worked but authz did not it seems
unlikely to be that... probably something to do with the startup of the
authservice.py script (see
tests/system_test.dir/system_tests_authz_service_plugin/AuthServicePluginAuthzTest/setUpClass/env-2.out
perhaps?)

---------------------------------------------------------------------
To unsubscribe, e-mail: [hidden email]
For additional commands, e-mail: [hidden email]

Reply | Threaded
Open this post in threaded view
|

Re: [VOTE] Release Qpid Dispatch Router 1.8.0 (RC1)

Michael Goulish
In reply to this post by Chuck Rolke
executive summary:   I change my vote to  *+1*

but with JIRAs.


OK! I have something.

I didn't remember it, but my notes show that I have seen this exact failure
before, also after a clean install.
( I mean the authz failure. The other one, the http failure is already
explained.)

So this means that the problem has got to be with my machine setup ---
there is some package that the authz test requires that I do not install
after a clean OS upgrade.

I do have a great plethora of SASL and SSL packages installed, so I don't
know what it might be, and I am having trouble tracing into the Python
code. If anyone has a clue, please let me know.

But, since the problem is limited to the test not warning about a required
package, I will do two things:

  1. raise a JIRA,

  2. and change my vote to

         *+1*




On Tue, Jun 11, 2019 at 12:04 PM Ganesh Murthy <[hidden email]> wrote:

> On Tue, Jun 11, 2019 at 11:58 AM Michael Goulish <[hidden email]>
> wrote:
>
> > Of course I will not change my vote based on a suggestion ( from me and
> > Gordon ) that the failure I am seeing might be caused by a missing
> > package.
> >
> > What I will do is start looking into this to see if that is indeed the
> > case.
> > And then we will make a change that detects and warns about that case.
> > And then I will change my vote.
> >
> Agreed, fair enough.
>
> >
> >
> >
> > On Tue, Jun 11, 2019 at 11:28 AM Chuck Rolke <[hidden email]> wrote:
> >
> > > +1
> > >
> > > * Checked checksums
> > > * Build/test Fedora 29, python 3
> > >   * Fails system_tests_http (known problem, not a regression)
> > > * Build/test Fedora 28, python 2
> > >   * Occasional test fail system_tests_fallback_dest
> > >     known problem in new test code and not in mission code; fix is
> > already
> > > on master; not a regression
> > >
> > >
> > > ----- Original Message -----
> > > > From: "Ganesh Murthy" <[hidden email]>
> > > > To: [hidden email], [hidden email]
> > > > Sent: Friday, June 7, 2019 11:23:40 AM
> > > > Subject: [VOTE] Release Qpid Dispatch Router 1.8.0 (RC1)
> > > >
> > > > Hello All,
> > > >          Please cast your vote on this thread to release RC1 as the
> > > > official Qpid Dispatch Router version  1.8.0.
> > > >
> > > > RC1 of Qpid Dispatch Router version 1.8.0 can be found here:
> > > >
> > > > https://dist.apache.org/repos/dist/dev/qpid/dispatch/1.8.0-rc1/
> > > >
> > > > The following features, improvements, and bug fixes are introduced in
> > > 1.8.0:
> > > >
> > > > Features -
> > > >    DISPATCH-1337 - Fallback Destination for Unreachable Addresses
> > > >
> > > > Improvements -
> > > >     DISPATCH-1308 - Console access to the force-close a connection
> > > feature
> > > >     DISPATCH-1320 - Make it easier to use separate logos for upstream
> > > > and downstream masthead
> > > >     DISPATCH-1321 - Set rpath for qpid-proton (and other
> dependencies)
> > > > when they are found in nonstandard location
> > > >     DISPATCH-1329 - Edge router system test needs skip test
> convenience
> > > >     switches
> > > >     DISPATCH-1340 - Show settlement rate and delayed deliveries in
> > client
> > > >     popup
> > > >     DISPATCH-1341 - Add list of delayed links to console's overview
> > page
> > > >     DISPATCH-1348 - Avoid qdr_error_t allocation if not necessary
> > > >     DISPATCH-1356 - Remove the dotted line around routers that
> > > > indicates the router is fixed.
> > > >     DISPATCH-1357 - Change the name of the 'Kill' feature to 'Close'
> > > >
> > > > Bug fixes -
> > > >     DISPATCH-974 - Getting connections via the router management
> > > > protocol causes AMQP framing errors
> > > >     DISPATCH-1230 - System test failing with OpenSSL >= 1.1 -
> > > >     system_tests_ssl
> > > >     DISPATCH-1312 - Remove cmake option USE_MEMORY_POOL
> > > >     DISPATCH-1317 - HTTP system test is failing on python2.6
> > > >     DISPATCH-1318 - edge_router system test failing
> > > >     DISPATCH-1322 - Edge router drops disposition when remote
> receiver
> > > closes
> > > >     DISPATCH-1323 - Deprecate addr and externalAddr attributes of
> > > > autoLink entity. Add address and externalAddress instead.
> > > >     DISPATCH-1324 - [tools] Scraper uses deprecated cgi.escape
> function
> > > >     DISPATCH-1325 - Sender connections to edge router that connect
> > > > 'too soon' never get credit
> > > >     DISPATCH-1326 - Anonymous messages are released by edge router
> > > > even if there is a receiver for the messages
> > > >     DISPATCH-1330 - Q2 stall due to incorrect msg buffer ref count
> > > > decrement on link detach
> > > >     DISPATCH-1334 - Background map on topology page incorrect height
> > > >     DISPATCH-1335 - After adding client, topology page shows new icon
> > > > in upper-left corner
> > > >     DISPATCH-1339 - Multiple consoles attached to a router are
> showing
> > > > as separate icons
> > > >
> > > >
> > > > Thanks.
> > > >
> > > > ---------------------------------------------------------------------
> > > > To unsubscribe, e-mail: [hidden email]
> > > > For additional commands, e-mail: [hidden email]
> > > >
> > > >
> > >
> > > ---------------------------------------------------------------------
> > > To unsubscribe, e-mail: [hidden email]
> > > For additional commands, e-mail: [hidden email]
> > >
> > >
> >
>
Reply | Threaded
Open this post in threaded view
|

Re: [VOTE] Release Qpid Dispatch Router 1.8.0 (RC1)

Ken Giusti
In reply to this post by Gordon Sim
+1 from me

build and unit test on Ubuntu 18 ok
oslo.messaging smoke test ok


On Fri, Jun 7, 2019 at 11:24 AM Ganesh Murthy <[hidden email]> wrote:

> Hello All,
>          Please cast your vote on this thread to release RC1 as the
> official Qpid Dispatch Router version  1.8.0.
>
> RC1 of Qpid Dispatch Router version 1.8.0 can be found here:
>
> https://dist.apache.org/repos/dist/dev/qpid/dispatch/1.8.0-rc1/
>
> The following features, improvements, and bug fixes are introduced in
> 1.8.0:
>
> Features -
>    DISPATCH-1337 - Fallback Destination for Unreachable Addresses
>
> Improvements -
>     DISPATCH-1308 - Console access to the force-close a connection feature
>     DISPATCH-1320 - Make it easier to use separate logos for upstream
> and downstream masthead
>     DISPATCH-1321 - Set rpath for qpid-proton (and other dependencies)
> when they are found in nonstandard location
>     DISPATCH-1329 - Edge router system test needs skip test convenience
> switches
>     DISPATCH-1340 - Show settlement rate and delayed deliveries in client
> popup
>     DISPATCH-1341 - Add list of delayed links to console's overview page
>     DISPATCH-1348 - Avoid qdr_error_t allocation if not necessary
>     DISPATCH-1356 - Remove the dotted line around routers that
> indicates the router is fixed.
>     DISPATCH-1357 - Change the name of the 'Kill' feature to 'Close'
>
> Bug fixes -
>     DISPATCH-974 - Getting connections via the router management
> protocol causes AMQP framing errors
>     DISPATCH-1230 - System test failing with OpenSSL >= 1.1 -
> system_tests_ssl
>     DISPATCH-1312 - Remove cmake option USE_MEMORY_POOL
>     DISPATCH-1317 - HTTP system test is failing on python2.6
>     DISPATCH-1318 - edge_router system test failing
>     DISPATCH-1322 - Edge router drops disposition when remote receiver
> closes
>     DISPATCH-1323 - Deprecate addr and externalAddr attributes of
> autoLink entity. Add address and externalAddress instead.
>     DISPATCH-1324 - [tools] Scraper uses deprecated cgi.escape function
>     DISPATCH-1325 - Sender connections to edge router that connect
> 'too soon' never get credit
>     DISPATCH-1326 - Anonymous messages are released by edge router
> even if there is a receiver for the messages
>     DISPATCH-1330 - Q2 stall due to incorrect msg buffer ref count
> decrement on link detach
>     DISPATCH-1334 - Background map on topology page incorrect height
>     DISPATCH-1335 - After adding client, topology page shows new icon
> in upper-left corner
>     DISPATCH-1339 - Multiple consoles attached to a router are showing
> as separate icons
>
>
> Thanks.
>
> ---------------------------------------------------------------------
> To unsubscribe, e-mail: [hidden email]
> For additional commands, e-mail: [hidden email]
>
>

--
-K