[jira] [Issue Comment Deleted] (DISPATCH-1814) Apply autofixes to resolve some flake8 code formatting issues

classic Classic list List threaded Threaded
1 message Options
Reply | Threaded
Open this post in threaded view
|

[jira] [Issue Comment Deleted] (DISPATCH-1814) Apply autofixes to resolve some flake8 code formatting issues

ASF subversion and git services (Jira)

     [ https://issues.apache.org/jira/browse/DISPATCH-1814?page=com.atlassian.jira.plugin.system.issuetabpanels:all-tabpanel ]

Jiri Daněk updated DISPATCH-1814:
---------------------------------
    Comment: was deleted

(was: Weird fail in macOS GHA job, I'll backup the log here, https://github.com/apache/qpid-proton/pull/289/checks?check_run_id=1708919094

{noformat}
test 30
      Start 30: python-tox-test

30: Test command: /Users/runner/hostedtoolcache/Python/3.6.12/x64/bin/python "/Users/runner/work/qpid-proton/qpid-proton/scripts/env.py" "--" "PATH=/Users/runner/work/qpid-proton/qpid-proton/BLD/c/tools:/Users/runner/work/qpid-proton/qpid-proton/BLD/c:/Users/runner/hostedtoolcache/Python/3.6.12/x64/bin:/Users/runner/hostedtoolcache/Python/3.6.12/x64:/Users/runner/go/bin:/Users/runner/hostedtoolcache/go/1.15.6/x64/bin:/usr/local/opt/pipx_bin:/Users/runner/.cargo/bin:/usr/local/lib/ruby/gems/2.7.0/bin:/usr/local/opt/ruby/bin:/usr/local/opt/curl/bin:/usr/local/bin:/usr/local/sbin:/Users/runner/bin:/Users/runner/.yarn/bin:/usr/local/go/bin:/Users/runner/Library/Android/sdk/tools:/Users/runner/Library/Android/sdk/platform-tools:/Users/runner/Library/Android/sdk/ndk-bundle:/Library/Frameworks/Mono.framework/Versions/Current/Commands:/usr/bin:/bin:/usr/sbin:/sbin:/Users/runner/.dotnet/tools:/Users/runner/.ghcup/bin:/Users/runner/hostedtoolcache/stack/2.5.1/x64" "SASLPASSWD=CyrusSASL_Saslpasswd_EXECUTABLE-NOTFOUND" "SWIG=/usr/local/bin/swig" "TOXENV=pep8,py27,py35,py36,py37,py38" "PY_TEST_DIR=/Users/runner/work/qpid-proton/qpid-proton/python/tests" "/Users/runner/hostedtoolcache/Python/3.6.12/x64/bin/python" "-m" "tox"
30: Test timeout computed to be: 1500
30: GLOB sdist-make: /Users/runner/work/qpid-proton/qpid-proton/BLD/python/dist/setup.py
30: pep8 create: /Users/runner/work/qpid-proton/qpid-proton/BLD/python/.tox/pep8
30: pep8 installdeps: flake8
30: pep8 inst: /Users/runner/work/qpid-proton/qpid-proton/BLD/python/.tox/.tmp/package/1/python-qpid-proton-0.34.0.zip
30: pep8 installed: flake8==3.8.4,importlib-metadata==3.4.0,mccabe==0.6.1,pycodestyle==2.6.0,pyflakes==2.2.0,python-qpid-proton @ file:///Users/runner/work/qpid-proton/qpid-proton/BLD/python/.tox/.tmp/package/1/python-qpid-proton-0.34.0.zip,typing-extensions==3.7.4.3,zipp==3.4.0
30: pep8 run-test-pre: PYTHONHASHSEED='2517940550'
30: pep8 run-test: commands[0] | flake8
30: py27 create: /Users/runner/work/qpid-proton/qpid-proton/BLD/python/.tox/py27
30: py27 inst: /Users/runner/work/qpid-proton/qpid-proton/BLD/python/.tox/.tmp/package/1/python-qpid-proton-0.34.0.zip
30: ERROR: invocation failed (exit code 1), logfile: /Users/runner/work/qpid-proton/qpid-proton/BLD/python/.tox/py27/log/py27-1.log
30: ================================== log start ===================================
30: DEPRECATION: Python 2.7 reached the end of its life on January 1st, 2020. Please upgrade your Python as Python 2.7 is no longer maintained. pip 21.0 will drop support for Python 2.7 in January 2021. More details about Python 2 support in pip can be found at https://pip.pypa.io/en/latest/development/release-process/#python-2-support pip 21.0 will remove support for this functionality.
30: Processing ./.tox/.tmp/package/1/python-qpid-proton-0.34.0.zip
30: Building wheels for collected packages: python-qpid-proton
30:   Building wheel for python-qpid-proton (setup.py): started
30:   Building wheel for python-qpid-proton (setup.py): finished with status 'error'
30:   ERROR: Command errored out with exit status 1:
30:    command: /Users/runner/work/qpid-proton/qpid-proton/BLD/python/.tox/py27/bin/python -u -c 'import sys, setuptools, tokenize; sys.argv[0] = '"'"'/private/var/folders/24/8k48jl6d249_n_qfxwsl6xvm0000gn/T/pip-req-build-3ZaeQ3/setup.py'"'"'; __file__='"'"'/private/var/folders/24/8k48jl6d249_n_qfxwsl6xvm0000gn/T/pip-req-build-3ZaeQ3/setup.py'"'"';f=getattr(tokenize, '"'"'open'"'"', open)(__file__);code=f.read().replace('"'"'\r\n'"'"', '"'"'\n'"'"');f.close();exec(compile(code, __file__, '"'"'exec'"'"'))' bdist_wheel -d /private/var/folders/24/8k48jl6d249_n_qfxwsl6xvm0000gn/T/pip-wheel-PeYIFU
30:        cwd: /private/var/folders/24/8k48jl6d249_n_qfxwsl6xvm0000gn/T/pip-req-build-3ZaeQ3/
30:   Complete output (79 lines):
30:   running bdist_wheel
30:   running build
30:   running build_py
30:   running build_ext
30:   running configure
30:   Did not find libqpid-proton-core via pkg-config:
30:   Building the bundled proton-c sources into the extension
30:   Using Proton C sources: /private/var/folders/24/8k48jl6d249_n_qfxwsl6xvm0000gn/T/pip-req-build-3ZaeQ3
30:   Using openssl version 1.1.1i (found via pkg-config)
30:   creating build
30:   creating build/temp.macosx-10.9-x86_64-2.7
30:   creating build/temp.macosx-10.9-x86_64-2.7/var
30:   creating build/temp.macosx-10.9-x86_64-2.7/var/folders
30:   creating build/temp.macosx-10.9-x86_64-2.7/var/folders/24
30:   creating build/temp.macosx-10.9-x86_64-2.7/var/folders/24/8k48jl6d249_n_qfxwsl6xvm0000gn
30:   creating build/temp.macosx-10.9-x86_64-2.7/var/folders/24/8k48jl6d249_n_qfxwsl6xvm0000gn/T
30:   cc -c /var/folders/24/8k48jl6d249_n_qfxwsl6xvm0000gn/T/sasl_client_doneroE0Al.c -o build/temp.macosx-10.9-x86_64-2.7/var/folders/24/8k48jl6d249_n_qfxwsl6xvm0000gn/T/sasl_client_doneroE0Al.o
30:   cc build/temp.macosx-10.9-x86_64-2.7/var/folders/24/8k48jl6d249_n_qfxwsl6xvm0000gn/T/sasl_client_doneroE0Al.o -lsasl2 -o build/temp.macosx-10.9-x86_64-2.7/a.out
30:   creating build/temp.macosx-10.9-x86_64-2.7/private
30:   creating build/temp.macosx-10.9-x86_64-2.7/private/var
30:   creating build/temp.macosx-10.9-x86_64-2.7/private/var/folders
30:   creating build/temp.macosx-10.9-x86_64-2.7/private/var/folders/24
30:   creating build/temp.macosx-10.9-x86_64-2.7/private/var/folders/24/8k48jl6d249_n_qfxwsl6xvm0000gn
30:   creating build/temp.macosx-10.9-x86_64-2.7/private/var/folders/24/8k48jl6d249_n_qfxwsl6xvm0000gn/T
30:   creating build/temp.macosx-10.9-x86_64-2.7/private/var/folders/24/8k48jl6d249_n_qfxwsl6xvm0000gn/T/pip-req-build-3ZaeQ3
30:   creating build/temp.macosx-10.9-x86_64-2.7/private/var/folders/24/8k48jl6d249_n_qfxwsl6xvm0000gn/T/pip-req-build-3ZaeQ3/src
30:   creating build/temp.macosx-10.9-x86_64-2.7/private/var/folders/24/8k48jl6d249_n_qfxwsl6xvm0000gn/T/pip-req-build-3ZaeQ3/src/core
30:   creating build/temp.macosx-10.9-x86_64-2.7/private/var/folders/24/8k48jl6d249_n_qfxwsl6xvm0000gn/T/pip-req-build-3ZaeQ3/src/core/object
30:   creating build/temp.macosx-10.9-x86_64-2.7/private/var/folders/24/8k48jl6d249_n_qfxwsl6xvm0000gn/T/pip-req-build-3ZaeQ3/src/compiler
30:   creating build/temp.macosx-10.9-x86_64-2.7/private/var/folders/24/8k48jl6d249_n_qfxwsl6xvm0000gn/T/pip-req-build-3ZaeQ3/src/compiler/gcc
30:   creating build/temp.macosx-10.9-x86_64-2.7/private/var/folders/24/8k48jl6d249_n_qfxwsl6xvm0000gn/T/pip-req-build-3ZaeQ3/src/ssl
30:   creating build/temp.macosx-10.9-x86_64-2.7/private/var/folders/24/8k48jl6d249_n_qfxwsl6xvm0000gn/T/pip-req-build-3ZaeQ3/src/sasl
30:   gcc -fno-strict-aliasing -fno-common -dynamic -arch x86_64 -g -DNDEBUG -g -fwrapv -O3 -Wall -Wstrict-prototypes -std=gnu99 -DPROTON_DECLARE_STATIC -Ibuild/include -I/private/var/folders/24/8k48jl6d249_n_qfxwsl6xvm0000gn/T/pip-req-build-3ZaeQ3/include -I/private/var/folders/24/8k48jl6d249_n_qfxwsl6xvm0000gn/T/pip-req-build-3ZaeQ3/src -I/usr/local/Cellar/openssl@1.1/1.1.1i/include -c /private/var/folders/24/8k48jl6d249_n_qfxwsl6xvm0000gn/T/pip-req-build-3ZaeQ3/src/core/log.c -o build/temp.macosx-10.9-x86_64-2.7/private/var/folders/24/8k48jl6d249_n_qfxwsl6xvm0000gn/T/pip-req-build-3ZaeQ3/src/core/log.o
30:   gcc -fno-strict-aliasing -fno-common -dynamic -arch x86_64 -g -DNDEBUG -g -fwrapv -O3 -Wall -Wstrict-prototypes -std=gnu99 -DPROTON_DECLARE_STATIC -Ibuild/include -I/private/var/folders/24/8k48jl6d249_n_qfxwsl6xvm0000gn/T/pip-req-build-3ZaeQ3/include -I/private/var/folders/24/8k48jl6d249_n_qfxwsl6xvm0000gn/T/pip-req-build-3ZaeQ3/src -I/usr/local/Cellar/openssl@1.1/1.1.1i/include -c /private/var/folders/24/8k48jl6d249_n_qfxwsl6xvm0000gn/T/pip-req-build-3ZaeQ3/src/core/codec.c -o build/temp.macosx-10.9-x86_64-2.7/private/var/folders/24/8k48jl6d249_n_qfxwsl6xvm0000gn/T/pip-req-build-3ZaeQ3/src/core/codec.o
30:   gcc -fno-strict-aliasing -fno-common -dynamic -arch x86_64 -g -DNDEBUG -g -fwrapv -O3 -Wall -Wstrict-prototypes -std=gnu99 -DPROTON_DECLARE_STATIC -Ibuild/include -I/private/var/folders/24/8k48jl6d249_n_qfxwsl6xvm0000gn/T/pip-req-build-3ZaeQ3/include -I/private/var/folders/24/8k48jl6d249_n_qfxwsl6xvm0000gn/T/pip-req-build-3ZaeQ3/src -I/usr/local/Cellar/openssl@1.1/1.1.1i/include -c /private/var/folders/24/8k48jl6d249_n_qfxwsl6xvm0000gn/T/pip-req-build-3ZaeQ3/src/core/buffer.c -o build/temp.macosx-10.9-x86_64-2.7/private/var/folders/24/8k48jl6d249_n_qfxwsl6xvm0000gn/T/pip-req-build-3ZaeQ3/src/core/buffer.o
30:   gcc -fno-strict-aliasing -fno-common -dynamic -arch x86_64 -g -DNDEBUG -g -fwrapv -O3 -Wall -Wstrict-prototypes -std=gnu99 -DPROTON_DECLARE_STATIC -Ibuild/include -I/private/var/folders/24/8k48jl6d249_n_qfxwsl6xvm0000gn/T/pip-req-build-3ZaeQ3/include -I/private/var/folders/24/8k48jl6d249_n_qfxwsl6xvm0000gn/T/pip-req-build-3ZaeQ3/src -I/usr/local/Cellar/openssl@1.1/1.1.1i/include -c /private/var/folders/24/8k48jl6d249_n_qfxwsl6xvm0000gn/T/pip-req-build-3ZaeQ3/src/core/dispatcher.c -o build/temp.macosx-10.9-x86_64-2.7/private/var/folders/24/8k48jl6d249_n_qfxwsl6xvm0000gn/T/pip-req-build-3ZaeQ3/src/core/dispatcher.o
30:   gcc -fno-strict-aliasing -fno-common -dynamic -arch x86_64 -g -DNDEBUG -g -fwrapv -O3 -Wall -Wstrict-prototypes -std=gnu99 -DPROTON_DECLARE_STATIC -Ibuild/include -I/private/var/folders/24/8k48jl6d249_n_qfxwsl6xvm0000gn/T/pip-req-build-3ZaeQ3/include -I/private/var/folders/24/8k48jl6d249_n_qfxwsl6xvm0000gn/T/pip-req-build-3ZaeQ3/src -I/usr/local/Cellar/openssl@1.1/1.1.1i/include -c /private/var/folders/24/8k48jl6d249_n_qfxwsl6xvm0000gn/T/pip-req-build-3ZaeQ3/src/core/transport.c -o build/temp.macosx-10.9-x86_64-2.7/private/var/folders/24/8k48jl6d249_n_qfxwsl6xvm0000gn/T/pip-req-build-3ZaeQ3/src/core/transport.o
30:   gcc -fno-strict-aliasing -fno-common -dynamic -arch x86_64 -g -DNDEBUG -g -fwrapv -O3 -Wall -Wstrict-prototypes -std=gnu99 -DPROTON_DECLARE_STATIC -Ibuild/include -I/private/var/folders/24/8k48jl6d249_n_qfxwsl6xvm0000gn/T/pip-req-build-3ZaeQ3/include -I/private/var/folders/24/8k48jl6d249_n_qfxwsl6xvm0000gn/T/pip-req-build-3ZaeQ3/src -I/usr/local/Cellar/openssl@1.1/1.1.1i/include -c /private/var/folders/24/8k48jl6d249_n_qfxwsl6xvm0000gn/T/pip-req-build-3ZaeQ3/src/core/memory.c -o build/temp.macosx-10.9-x86_64-2.7/private/var/folders/24/8k48jl6d249_n_qfxwsl6xvm0000gn/T/pip-req-build-3ZaeQ3/src/core/memory.o
30:   gcc -fno-strict-aliasing -fno-common -dynamic -arch x86_64 -g -DNDEBUG -g -fwrapv -O3 -Wall -Wstrict-prototypes -std=gnu99 -DPROTON_DECLARE_STATIC -Ibuild/include -I/private/var/folders/24/8k48jl6d249_n_qfxwsl6xvm0000gn/T/pip-req-build-3ZaeQ3/include -I/private/var/folders/24/8k48jl6d249_n_qfxwsl6xvm0000gn/T/pip-req-build-3ZaeQ3/src -I/usr/local/Cellar/openssl@1.1/1.1.1i/include -c /private/var/folders/24/8k48jl6d249_n_qfxwsl6xvm0000gn/T/pip-req-build-3ZaeQ3/src/core/util.c -o build/temp.macosx-10.9-x86_64-2.7/private/var/folders/24/8k48jl6d249_n_qfxwsl6xvm0000gn/T/pip-req-build-3ZaeQ3/src/core/util.o
30:   gcc -fno-strict-aliasing -fno-common -dynamic -arch x86_64 -g -DNDEBUG -g -fwrapv -O3 -Wall -Wstrict-prototypes -std=gnu99 -DPROTON_DECLARE_STATIC -Ibuild/include -I/private/var/folders/24/8k48jl6d249_n_qfxwsl6xvm0000gn/T/pip-req-build-3ZaeQ3/include -I/private/var/folders/24/8k48jl6d249_n_qfxwsl6xvm0000gn/T/pip-req-build-3ZaeQ3/src -I/usr/local/Cellar/openssl@1.1/1.1.1i/include -c /private/var/folders/24/8k48jl6d249_n_qfxwsl6xvm0000gn/T/pip-req-build-3ZaeQ3/src/core/framing.c -o build/temp.macosx-10.9-x86_64-2.7/private/var/folders/24/8k48jl6d249_n_qfxwsl6xvm0000gn/T/pip-req-build-3ZaeQ3/src/core/framing.o
30:   gcc -fno-strict-aliasing -fno-common -dynamic -arch x86_64 -g -DNDEBUG -g -fwrapv -O3 -Wall -Wstrict-prototypes -std=gnu99 -DPROTON_DECLARE_STATIC -Ibuild/include -I/private/var/folders/24/8k48jl6d249_n_qfxwsl6xvm0000gn/T/pip-req-build-3ZaeQ3/include -I/private/var/folders/24/8k48jl6d249_n_qfxwsl6xvm0000gn/T/pip-req-build-3ZaeQ3/src -I/usr/local/Cellar/openssl@1.1/1.1.1i/include -c /private/var/folders/24/8k48jl6d249_n_qfxwsl6xvm0000gn/T/pip-req-build-3ZaeQ3/src/core/encoder.c -o build/temp.macosx-10.9-x86_64-2.7/private/var/folders/24/8k48jl6d249_n_qfxwsl6xvm0000gn/T/pip-req-build-3ZaeQ3/src/core/encoder.o
30:   gcc -fno-strict-aliasing -fno-common -dynamic -arch x86_64 -g -DNDEBUG -g -fwrapv -O3 -Wall -Wstrict-prototypes -std=gnu99 -DPROTON_DECLARE_STATIC -Ibuild/include -I/private/var/folders/24/8k48jl6d249_n_qfxwsl6xvm0000gn/T/pip-req-build-3ZaeQ3/include -I/private/var/folders/24/8k48jl6d249_n_qfxwsl6xvm0000gn/T/pip-req-build-3ZaeQ3/src -I/usr/local/Cellar/openssl@1.1/1.1.1i/include -c /private/var/folders/24/8k48jl6d249_n_qfxwsl6xvm0000gn/T/pip-req-build-3ZaeQ3/src/core/logger.c -o build/temp.macosx-10.9-x86_64-2.7/private/var/folders/24/8k48jl6d249_n_qfxwsl6xvm0000gn/T/pip-req-build-3ZaeQ3/src/core/logger.o
30:   gcc -fno-strict-aliasing -fno-common -dynamic -arch x86_64 -g -DNDEBUG -g -fwrapv -O3 -Wall -Wstrict-prototypes -std=gnu99 -DPROTON_DECLARE_STATIC -Ibuild/include -I/private/var/folders/24/8k48jl6d249_n_qfxwsl6xvm0000gn/T/pip-req-build-3ZaeQ3/include -I/private/var/folders/24/8k48jl6d249_n_qfxwsl6xvm0000gn/T/pip-req-build-3ZaeQ3/src -I/usr/local/Cellar/openssl@1.1/1.1.1i/include -c /private/var/folders/24/8k48jl6d249_n_qfxwsl6xvm0000gn/T/pip-req-build-3ZaeQ3/src/core/init.c -o build/temp.macosx-10.9-x86_64-2.7/private/var/folders/24/8k48jl6d249_n_qfxwsl6xvm0000gn/T/pip-req-build-3ZaeQ3/src/core/init.o
30:   gcc -fno-strict-aliasing -fno-common -dynamic -arch x86_64 -g -DNDEBUG -g -fwrapv -O3 -Wall -Wstrict-prototypes -std=gnu99 -DPROTON_DECLARE_STATIC -Ibuild/include -I/private/var/folders/24/8k48jl6d249_n_qfxwsl6xvm0000gn/T/pip-req-build-3ZaeQ3/include -I/private/var/folders/24/8k48jl6d249_n_qfxwsl6xvm0000gn/T/pip-req-build-3ZaeQ3/src -I/usr/local/Cellar/openssl@1.1/1.1.1i/include -c /private/var/folders/24/8k48jl6d249_n_qfxwsl6xvm0000gn/T/pip-req-build-3ZaeQ3/src/core/engine.c -o build/temp.macosx-10.9-x86_64-2.7/private/var/folders/24/8k48jl6d249_n_qfxwsl6xvm0000gn/T/pip-req-build-3ZaeQ3/src/core/engine.o
30:   gcc -fno-strict-aliasing -fno-common -dynamic -arch x86_64 -g -DNDEBUG -g -fwrapv -O3 -Wall -Wstrict-prototypes -std=gnu99 -DPROTON_DECLARE_STATIC -Ibuild/include -I/private/var/folders/24/8k48jl6d249_n_qfxwsl6xvm0000gn/T/pip-req-build-3ZaeQ3/include -I/private/var/folders/24/8k48jl6d249_n_qfxwsl6xvm0000gn/T/pip-req-build-3ZaeQ3/src -I/usr/local/Cellar/openssl@1.1/1.1.1i/include -c /private/var/folders/24/8k48jl6d249_n_qfxwsl6xvm0000gn/T/pip-req-build-3ZaeQ3/src/core/error.c -o build/temp.macosx-10.9-x86_64-2.7/private/var/folders/24/8k48jl6d249_n_qfxwsl6xvm0000gn/T/pip-req-build-3ZaeQ3/src/core/error.o
30:   gcc -fno-strict-aliasing -fno-common -dynamic -arch x86_64 -g -DNDEBUG -g -fwrapv -O3 -Wall -Wstrict-prototypes -std=gnu99 -DPROTON_DECLARE_STATIC -Ibuild/include -I/private/var/folders/24/8k48jl6d249_n_qfxwsl6xvm0000gn/T/pip-req-build-3ZaeQ3/include -I/private/var/folders/24/8k48jl6d249_n_qfxwsl6xvm0000gn/T/pip-req-build-3ZaeQ3/src -I/usr/local/Cellar/openssl@1.1/1.1.1i/include -c /private/var/folders/24/8k48jl6d249_n_qfxwsl6xvm0000gn/T/pip-req-build-3ZaeQ3/src/core/event.c -o build/temp.macosx-10.9-x86_64-2.7/private/var/folders/24/8k48jl6d249_n_qfxwsl6xvm0000gn/T/pip-req-build-3ZaeQ3/src/core/event.o
30:   gcc -fno-strict-aliasing -fno-common -dynamic -arch x86_64 -g -DNDEBUG -g -fwrapv -O3 -Wall -Wstrict-prototypes -std=gnu99 -DPROTON_DECLARE_STATIC -Ibuild/include -I/private/var/folders/24/8k48jl6d249_n_qfxwsl6xvm0000gn/T/pip-req-build-3ZaeQ3/include -I/private/var/folders/24/8k48jl6d249_n_qfxwsl6xvm0000gn/T/pip-req-build-3ZaeQ3/src -I/usr/local/Cellar/openssl@1.1/1.1.1i/include -c /private/var/folders/24/8k48jl6d249_n_qfxwsl6xvm0000gn/T/pip-req-build-3ZaeQ3/src/core/types.c -o build/temp.macosx-10.9-x86_64-2.7/private/var/folders/24/8k48jl6d249_n_qfxwsl6xvm0000gn/T/pip-req-build-3ZaeQ3/src/core/types.o
30:   gcc -fno-strict-aliasing -fno-common -dynamic -arch x86_64 -g -DNDEBUG -g -fwrapv -O3 -Wall -Wstrict-prototypes -std=gnu99 -DPROTON_DECLARE_STATIC -Ibuild/include -I/private/var/folders/24/8k48jl6d249_n_qfxwsl6xvm0000gn/T/pip-req-build-3ZaeQ3/include -I/private/var/folders/24/8k48jl6d249_n_qfxwsl6xvm0000gn/T/pip-req-build-3ZaeQ3/src -I/usr/local/Cellar/openssl@1.1/1.1.1i/include -c /private/var/folders/24/8k48jl6d249_n_qfxwsl6xvm0000gn/T/pip-req-build-3ZaeQ3/src/core/decoder.c -o build/temp.macosx-10.9-x86_64-2.7/private/var/folders/24/8k48jl6d249_n_qfxwsl6xvm0000gn/T/pip-req-build-3ZaeQ3/src/core/decoder.o
30:   gcc -fno-strict-aliasing -fno-common -dynamic -arch x86_64 -g -DNDEBUG -g -fwrapv -O3 -Wall -Wstrict-prototypes -std=gnu99 -DPROTON_DECLARE_STATIC -Ibuild/include -I/private/var/folders/24/8k48jl6d249_n_qfxwsl6xvm0000gn/T/pip-req-build-3ZaeQ3/include -I/private/var/folders/24/8k48jl6d249_n_qfxwsl6xvm0000gn/T/pip-req-build-3ZaeQ3/src -I/usr/local/Cellar/openssl@1.1/1.1.1i/include -c /private/var/folders/24/8k48jl6d249_n_qfxwsl6xvm0000gn/T/pip-req-build-3ZaeQ3/src/core/connection_driver.c -o build/temp.macosx-10.9-x86_64-2.7/private/var/folders/24/8k48jl6d249_n_qfxwsl6xvm0000gn/T/pip-req-build-3ZaeQ3/src/core/connection_driver.o
30:   gcc -fno-strict-aliasing -fno-common -dynamic -arch x86_64 -g -DNDEBUG -g -fwrapv -O3 -Wall -Wstrict-prototypes -std=gnu99 -DPROTON_DECLARE_STATIC -Ibuild/include -I/private/var/folders/24/8k48jl6d249_n_qfxwsl6xvm0000gn/T/pip-req-build-3ZaeQ3/include -I/private/var/folders/24/8k48jl6d249_n_qfxwsl6xvm0000gn/T/pip-req-build-3ZaeQ3/src -I/usr/local/Cellar/openssl@1.1/1.1.1i/include -c /private/var/folders/24/8k48jl6d249_n_qfxwsl6xvm0000gn/T/pip-req-build-3ZaeQ3/src/core/autodetect.c -o build/temp.macosx-10.9-x86_64-2.7/private/var/folders/24/8k48jl6d249_n_qfxwsl6xvm0000gn/T/pip-req-build-3ZaeQ3/src/core/autodetect.o
30:   gcc -fno-strict-aliasing -fno-common -dynamic -arch x86_64 -g -DNDEBUG -g -fwrapv -O3 -Wall -Wstrict-prototypes -std=gnu99 -DPROTON_DECLARE_STATIC -Ibuild/include -I/private/var/folders/24/8k48jl6d249_n_qfxwsl6xvm0000gn/T/pip-req-build-3ZaeQ3/include -I/private/var/folders/24/8k48jl6d249_n_qfxwsl6xvm0000gn/T/pip-req-build-3ZaeQ3/src -I/usr/local/Cellar/openssl@1.1/1.1.1i/include -c /private/var/folders/24/8k48jl6d249_n_qfxwsl6xvm0000gn/T/pip-req-build-3ZaeQ3/src/core/message.c -o build/temp.macosx-10.9-x86_64-2.7/private/var/folders/24/8k48jl6d249_n_qfxwsl6xvm0000gn/T/pip-req-build-3ZaeQ3/src/core/message.o
30:   gcc -fno-strict-aliasing -fno-common -dynamic -arch x86_64 -g -DNDEBUG -g -fwrapv -O3 -Wall -Wstrict-prototypes -std=gnu99 -DPROTON_DECLARE_STATIC -Ibuild/include -I/private/var/folders/24/8k48jl6d249_n_qfxwsl6xvm0000gn/T/pip-req-build-3ZaeQ3/include -I/private/var/folders/24/8k48jl6d249_n_qfxwsl6xvm0000gn/T/pip-req-build-3ZaeQ3/src -I/usr/local/Cellar/openssl@1.1/1.1.1i/include -c /private/var/folders/24/8k48jl6d249_n_qfxwsl6xvm0000gn/T/pip-req-build-3ZaeQ3/src/core/object/list.c -o build/temp.macosx-10.9-x86_64-2.7/private/var/folders/24/8k48jl6d249_n_qfxwsl6xvm0000gn/T/pip-req-build-3ZaeQ3/src/core/object/list.o
30:   gcc -fno-strict-aliasing -fno-common -dynamic -arch x86_64 -g -DNDEBUG -g -fwrapv -O3 -Wall -Wstrict-prototypes -std=gnu99 -DPROTON_DECLARE_STATIC -Ibuild/include -I/private/var/folders/24/8k48jl6d249_n_qfxwsl6xvm0000gn/T/pip-req-build-3ZaeQ3/include -I/private/var/folders/24/8k48jl6d249_n_qfxwsl6xvm0000gn/T/pip-req-build-3ZaeQ3/src -I/usr/local/Cellar/openssl@1.1/1.1.1i/include -c /private/var/folders/24/8k48jl6d249_n_qfxwsl6xvm0000gn/T/pip-req-build-3ZaeQ3/src/core/object/object.c -o build/temp.macosx-10.9-x86_64-2.7/private/var/folders/24/8k48jl6d249_n_qfxwsl6xvm0000gn/T/pip-req-build-3ZaeQ3/src/core/object/object.o
30:   gcc -fno-strict-aliasing -fno-common -dynamic -arch x86_64 -g -DNDEBUG -g -fwrapv -O3 -Wall -Wstrict-prototypes -std=gnu99 -DPROTON_DECLARE_STATIC -Ibuild/include -I/private/var/folders/24/8k48jl6d249_n_qfxwsl6xvm0000gn/T/pip-req-build-3ZaeQ3/include -I/private/var/folders/24/8k48jl6d249_n_qfxwsl6xvm0000gn/T/pip-req-build-3ZaeQ3/src -I/usr/local/Cellar/openssl@1.1/1.1.1i/include -c /private/var/folders/24/8k48jl6d249_n_qfxwsl6xvm0000gn/T/pip-req-build-3ZaeQ3/src/core/object/string.c -o build/temp.macosx-10.9-x86_64-2.7/private/var/folders/24/8k48jl6d249_n_qfxwsl6xvm0000gn/T/pip-req-build-3ZaeQ3/src/core/object/string.o
30:   gcc -fno-strict-aliasing -fno-common -dynamic -arch x86_64 -g -DNDEBUG -g -fwrapv -O3 -Wall -Wstrict-prototypes -std=gnu99 -DPROTON_DECLARE_STATIC -Ibuild/include -I/private/var/folders/24/8k48jl6d249_n_qfxwsl6xvm0000gn/T/pip-req-build-3ZaeQ3/include -I/private/var/folders/24/8k48jl6d249_n_qfxwsl6xvm0000gn/T/pip-req-build-3ZaeQ3/src -I/usr/local/Cellar/openssl@1.1/1.1.1i/include -c /private/var/folders/24/8k48jl6d249_n_qfxwsl6xvm0000gn/T/pip-req-build-3ZaeQ3/src/core/object/iterator.c -o build/temp.macosx-10.9-x86_64-2.7/private/var/folders/24/8k48jl6d249_n_qfxwsl6xvm0000gn/T/pip-req-build-3ZaeQ3/src/core/object/iterator.o
30:   gcc -fno-strict-aliasing -fno-common -dynamic -arch x86_64 -g -DNDEBUG -g -fwrapv -O3 -Wall -Wstrict-prototypes -std=gnu99 -DPROTON_DECLARE_STATIC -Ibuild/include -I/private/var/folders/24/8k48jl6d249_n_qfxwsl6xvm0000gn/T/pip-req-build-3ZaeQ3/include -I/private/var/folders/24/8k48jl6d249_n_qfxwsl6xvm0000gn/T/pip-req-build-3ZaeQ3/src -I/usr/local/Cellar/openssl@1.1/1.1.1i/include -c /private/var/folders/24/8k48jl6d249_n_qfxwsl6xvm0000gn/T/pip-req-build-3ZaeQ3/src/core/object/map.c -o build/temp.macosx-10.9-x86_64-2.7/private/var/folders/24/8k48jl6d249_n_qfxwsl6xvm0000gn/T/pip-req-build-3ZaeQ3/src/core/object/map.o
30:   gcc -fno-strict-aliasing -fno-common -dynamic -arch x86_64 -g -DNDEBUG -g -fwrapv -O3 -Wall -Wstrict-prototypes -std=gnu99 -DPROTON_DECLARE_STATIC -Ibuild/include -I/private/var/folders/24/8k48jl6d249_n_qfxwsl6xvm0000gn/T/pip-req-build-3ZaeQ3/include -I/private/var/folders/24/8k48jl6d249_n_qfxwsl6xvm0000gn/T/pip-req-build-3ZaeQ3/src -I/usr/local/Cellar/openssl@1.1/1.1.1i/include -c /private/var/folders/24/8k48jl6d249_n_qfxwsl6xvm0000gn/T/pip-req-build-3ZaeQ3/src/core/object/record.c -o build/temp.macosx-10.9-x86_64-2.7/private/var/folders/24/8k48jl6d249_n_qfxwsl6xvm0000gn/T/pip-req-build-3ZaeQ3/src/core/object/record.o
30:   gcc -fno-strict-aliasing -fno-common -dynamic -arch x86_64 -g -DNDEBUG -g -fwrapv -O3 -Wall -Wstrict-prototypes -std=gnu99 -DPROTON_DECLARE_STATIC -Ibuild/include -I/private/var/folders/24/8k48jl6d249_n_qfxwsl6xvm0000gn/T/pip-req-build-3ZaeQ3/include -I/private/var/folders/24/8k48jl6d249_n_qfxwsl6xvm0000gn/T/pip-req-build-3ZaeQ3/src -I/usr/local/Cellar/openssl@1.1/1.1.1i/include -c /private/var/folders/24/8k48jl6d249_n_qfxwsl6xvm0000gn/T/pip-req-build-3ZaeQ3/src/compiler/gcc/start.c -o build/temp.macosx-10.9-x86_64-2.7/private/var/folders/24/8k48jl6d249_n_qfxwsl6xvm0000gn/T/pip-req-build-3ZaeQ3/src/compiler/gcc/start.o
30:   gcc -fno-strict-aliasing -fno-common -dynamic -arch x86_64 -g -DNDEBUG -g -fwrapv -O3 -Wall -Wstrict-prototypes -std=gnu99 -DPROTON_DECLARE_STATIC -Ibuild/include -I/private/var/folders/24/8k48jl6d249_n_qfxwsl6xvm0000gn/T/pip-req-build-3ZaeQ3/include -I/private/var/folders/24/8k48jl6d249_n_qfxwsl6xvm0000gn/T/pip-req-build-3ZaeQ3/src -I/usr/local/Cellar/openssl@1.1/1.1.1i/include -c /private/var/folders/24/8k48jl6d249_n_qfxwsl6xvm0000gn/T/pip-req-build-3ZaeQ3/src/ssl/openssl.c -o build/temp.macosx-10.9-x86_64-2.7/private/var/folders/24/8k48jl6d249_n_qfxwsl6xvm0000gn/T/pip-req-build-3ZaeQ3/src/ssl/openssl.o
30:   gcc -fno-strict-aliasing -fno-common -dynamic -arch x86_64 -g -DNDEBUG -g -fwrapv -O3 -Wall -Wstrict-prototypes -std=gnu99 -DPROTON_DECLARE_STATIC -Ibuild/include -I/private/var/folders/24/8k48jl6d249_n_qfxwsl6xvm0000gn/T/pip-req-build-3ZaeQ3/include -I/private/var/folders/24/8k48jl6d249_n_qfxwsl6xvm0000gn/T/pip-req-build-3ZaeQ3/src -I/usr/local/Cellar/openssl@1.1/1.1.1i/include -c /private/var/folders/24/8k48jl6d249_n_qfxwsl6xvm0000gn/T/pip-req-build-3ZaeQ3/src/sasl/sasl.c -o build/temp.macosx-10.9-x86_64-2.7/private/var/folders/24/8k48jl6d249_n_qfxwsl6xvm0000gn/T/pip-req-build-3ZaeQ3/src/sasl/sasl.o
30:   gcc -fno-strict-aliasing -fno-common -dynamic -arch x86_64 -g -DNDEBUG -g -fwrapv -O3 -Wall -Wstrict-prototypes -std=gnu99 -DPROTON_DECLARE_STATIC -Ibuild/include -I/private/var/folders/24/8k48jl6d249_n_qfxwsl6xvm0000gn/T/pip-req-build-3ZaeQ3/include -I/private/var/folders/24/8k48jl6d249_n_qfxwsl6xvm0000gn/T/pip-req-build-3ZaeQ3/src -I/usr/local/Cellar/openssl@1.1/1.1.1i/include -c /private/var/folders/24/8k48jl6d249_n_qfxwsl6xvm0000gn/T/pip-req-build-3ZaeQ3/src/sasl/default_sasl.c -o build/temp.macosx-10.9-x86_64-2.7/private/var/folders/24/8k48jl6d249_n_qfxwsl6xvm0000gn/T/pip-req-build-3ZaeQ3/src/sasl/default_sasl.o
30:   gcc -fno-strict-aliasing -fno-common -dynamic -arch x86_64 -g -DNDEBUG -g -fwrapv -O3 -Wall -Wstrict-prototypes -std=gnu99 -DPROTON_DECLARE_STATIC -Ibuild/include -I/private/var/folders/24/8k48jl6d249_n_qfxwsl6xvm0000gn/T/pip-req-build-3ZaeQ3/include -I/private/var/folders/24/8k48jl6d249_n_qfxwsl6xvm0000gn/T/pip-req-build-3ZaeQ3/src -I/usr/local/Cellar/openssl@1.1/1.1.1i/include -c /private/var/folders/24/8k48jl6d249_n_qfxwsl6xvm0000gn/T/pip-req-build-3ZaeQ3/src/sasl/cyrus_sasl.c -o build/temp.macosx-10.9-x86_64-2.7/private/var/folders/24/8k48jl6d249_n_qfxwsl6xvm0000gn/T/pip-req-build-3ZaeQ3/src/sasl/cyrus_sasl.o
30:   building '_cproton' extension
30:   gcc -fno-strict-aliasing -fno-common -dynamic -arch x86_64 -g -DNDEBUG -g -fwrapv -O3 -Wall -Wstrict-prototypes -Ibuild/include -I/private/var/folders/24/8k48jl6d249_n_qfxwsl6xvm0000gn/T/pip-req-build-3ZaeQ3/include -I/Users/runner/work/qpid-proton/qpid-proton/BLD/python/.tox/py27/include/python2.7 -c cproton_wrap.c -o build/temp.macosx-10.9-x86_64-2.7/cproton_wrap.o -DPROTON_DECLARE_STATIC
30:   cproton_wrap.c:5981:12: warning: unused function 'check_state' [-Wunused-function]
30:   static int check_state(int x) {
30:              ^
30:   cproton_wrap.c:5992:12: warning: unused function 'check_disposition' [-Wunused-function]
30:   static int check_disposition(int x) {
30:              ^
30:   cproton_wrap.c:6003:12: warning: unused function 'check_trace' [-Wunused-function]
30:   static int check_trace(int x) {
30:              ^
30:   3 warnings generated.
30:   creating build/lib.macosx-10.9-x86_64-2.7
30:   gcc -bundle -undefined dynamic_lookup -arch x86_64 -g build/temp.macosx-10.9-x86_64-2.7/cproton_wrap.o build/temp.macosx-10.9-x86_64-2.7/private/var/folders/24/8k48jl6d249_n_qfxwsl6xvm0000gn/T/pip-req-build-3ZaeQ3/src/core/log.o build/temp.macosx-10.9-x86_64-2.7/private/var/folders/24/8k48jl6d249_n_qfxwsl6xvm0000gn/T/pip-req-build-3ZaeQ3/src/core/codec.o build/temp.macosx-10.9-x86_64-2.7/private/var/folders/24/8k48jl6d249_n_qfxwsl6xvm0000gn/T/pip-req-build-3ZaeQ3/src/core/buffer.o build/temp.macosx-10.9-x86_64-2.7/private/var/folders/24/8k48jl6d249_n_qfxwsl6xvm0000gn/T/pip-req-build-3ZaeQ3/src/core/dispatcher.o build/temp.macosx-10.9-x86_64-2.7/private/var/folders/24/8k48jl6d249_n_qfxwsl6xvm0000gn/T/pip-req-build-3ZaeQ3/src/core/transport.o build/temp.macosx-10.9-x86_64-2.7/private/var/folders/24/8k48jl6d249_n_qfxwsl6xvm0000gn/T/pip-req-build-3ZaeQ3/src/core/memory.o build/temp.macosx-10.9-x86_64-2.7/private/var/folders/24/8k48jl6d249_n_qfxwsl6xvm0000gn/T/pip-req-build-3ZaeQ3/src/core/util.o build/temp.macosx-10.9-x86_64-2.7/private/var/folders/24/8k48jl6d249_n_qfxwsl6xvm0000gn/T/pip-req-build-3ZaeQ3/src/core/framing.o build/temp.macosx-10.9-x86_64-2.7/private/var/folders/24/8k48jl6d249_n_qfxwsl6xvm0000gn/T/pip-req-build-3ZaeQ3/src/core/encoder.o build/temp.macosx-10.9-x86_64-2.7/private/var/folders/24/8k48jl6d249_n_qfxwsl6xvm0000gn/T/pip-req-build-3ZaeQ3/src/core/logger.o build/temp.macosx-10.9-x86_64-2.7/private/var/folders/24/8k48jl6d249_n_qfxwsl6xvm0000gn/T/pip-req-build-3ZaeQ3/src/core/init.o build/temp.macosx-10.9-x86_64-2.7/private/var/folders/24/8k48jl6d249_n_qfxwsl6xvm0000gn/T/pip-req-build-3ZaeQ3/src/core/engine.o build/temp.macosx-10.9-x86_64-2.7/private/var/folders/24/8k48jl6d249_n_qfxwsl6xvm0000gn/T/pip-req-build-3ZaeQ3/src/core/error.o build/temp.macosx-10.9-x86_64-2.7/private/var/folders/24/8k48jl6d249_n_qfxwsl6xvm0000gn/T/pip-req-build-3ZaeQ3/src/core/event.o build/temp.macosx-10.9-x86_64-2.7/private/var/folders/24/8k48jl6d249_n_qfxwsl6xvm0000gn/T/pip-req-build-3ZaeQ3/src/core/types.o build/temp.macosx-10.9-x86_64-2.7/private/var/folders/24/8k48jl6d249_n_qfxwsl6xvm0000gn/T/pip-req-build-3ZaeQ3/src/core/decoder.o build/temp.macosx-10.9-x86_64-2.7/private/var/folders/24/8k48jl6d249_n_qfxwsl6xvm0000gn/T/pip-req-build-3ZaeQ3/src/core/connection_driver.o build/temp.macosx-10.9-x86_64-2.7/private/var/folders/24/8k48jl6d249_n_qfxwsl6xvm0000gn/T/pip-req-build-3ZaeQ3/src/core/autodetect.o build/temp.macosx-10.9-x86_64-2.7/private/var/folders/24/8k48jl6d249_n_qfxwsl6xvm0000gn/T/pip-req-build-3ZaeQ3/src/core/message.o build/temp.macosx-10.9-x86_64-2.7/private/var/folders/24/8k48jl6d249_n_qfxwsl6xvm0000gn/T/pip-req-build-3ZaeQ3/src/core/object/list.o build/temp.macosx-10.9-x86_64-2.7/private/var/folders/24/8k48jl6d249_n_qfxwsl6xvm0000gn/T/pip-req-build-3ZaeQ3/src/core/object/object.o build/temp.macosx-10.9-x86_64-2.7/private/var/folders/24/8k48jl6d249_n_qfxwsl6xvm0000gn/T/pip-req-build-3ZaeQ3/src/core/object/string.o build/temp.macosx-10.9-x86_64-2.7/private/var/folders/24/8k48jl6d249_n_qfxwsl6xvm0000gn/T/pip-req-build-3ZaeQ3/src/core/object/iterator.o build/temp.macosx-10.9-x86_64-2.7/private/var/folders/24/8k48jl6d249_n_qfxwsl6xvm0000gn/T/pip-req-build-3ZaeQ3/src/core/object/map.o build/temp.macosx-10.9-x86_64-2.7/private/var/folders/24/8k48jl6d249_n_qfxwsl6xvm0000gn/T/pip-req-build-3ZaeQ3/src/core/object/record.o build/temp.macosx-10.9-x86_64-2.7/private/var/folders/24/8k48jl6d249_n_qfxwsl6xvm0000gn/T/pip-req-build-3ZaeQ3/src/compiler/gcc/start.o build/temp.macosx-10.9-x86_64-2.7/private/var/folders/24/8k48jl6d249_n_qfxwsl6xvm0000gn/T/pip-req-build-3ZaeQ3/src/ssl/openssl.o build/temp.macosx-10.9-x86_64-2.7/private/var/folders/24/8k48jl6d249_n_qfxwsl6xvm0000gn/T/pip-req-build-3ZaeQ3/src/sasl/sasl.o build/temp.macosx-10.9-x86_64-2.7/private/var/folders/24/8k48jl6d249_n_qfxwsl6xvm0000gn/T/pip-req-build-3ZaeQ3/src/sasl/default_sasl.o build/temp.macosx-10.9-x86_64-2.7/private/var/folders/24/8k48jl6d249_n_qfxwsl6xvm0000gn/T/pip-req-build-3ZaeQ3/src/sasl/cyrus_sasl.o -lssl -lcrypto -lsasl2 -o build/lib.macosx-10.9-x86_64-2.7/_cproton.so
30:   ld: library not found for -lssl
30:   clang: error: linker command failed with exit code 1 (use -v to see invocation)
30:   error: command 'gcc' failed with exit status 1
30:   ----------------------------------------
30:   ERROR: Failed building wheel for python-qpid-proton
30:   Running setup.py clean for python-qpid-proton
30: Failed to build python-qpid-proton
30: Installing collected packages: python-qpid-proton
30:     Running setup.py install for python-qpid-proton: started
30:     Running setup.py install for python-qpid-proton: finished with status 'error'
30:     ERROR: Command errored out with exit status 1:
30:      command: /Users/runner/work/qpid-proton/qpid-proton/BLD/python/.tox/py27/bin/python -u -c 'import sys, setuptools, tokenize; sys.argv[0] = '"'"'/private/var/folders/24/8k48jl6d249_n_qfxwsl6xvm0000gn/T/pip-req-build-3ZaeQ3/setup.py'"'"'; __file__='"'"'/private/var/folders/24/8k48jl6d249_n_qfxwsl6xvm0000gn/T/pip-req-build-3ZaeQ3/setup.py'"'"';f=getattr(tokenize, '"'"'open'"'"', open)(__file__);code=f.read().replace('"'"'\r\n'"'"', '"'"'\n'"'"');f.close();exec(compile(code, __file__, '"'"'exec'"'"'))' install --record /private/var/folders/24/8k48jl6d249_n_qfxwsl6xvm0000gn/T/pip-record-Rnf6gx/install-record.txt --single-version-externally-managed --compile --install-headers /Users/runner/work/qpid-proton/qpid-proton/BLD/python/.tox/py27/include/site/python2.7/python-qpid-proton
30:          cwd: /private/var/folders/24/8k48jl6d249_n_qfxwsl6xvm0000gn/T/pip-req-build-3ZaeQ3/
30:     Complete output (79 lines):
30:     running install
30:     running build
30:     running build_py
30:     running build_ext
30:     running configure
30:     Did not find libqpid-proton-core via pkg-config:
30:     Building the bundled proton-c sources into the extension
30:     Using Proton C sources: /private/var/folders/24/8k48jl6d249_n_qfxwsl6xvm0000gn/T/pip-req-build-3ZaeQ3
30:     Using openssl version 1.1.1i (found via pkg-config)
30:     creating build
30:     creating build/temp.macosx-10.9-x86_64-2.7
30:     creating build/temp.macosx-10.9-x86_64-2.7/var
30:     creating build/temp.macosx-10.9-x86_64-2.7/var/folders
30:     creating build/temp.macosx-10.9-x86_64-2.7/var/folders/24
30:     creating build/temp.macosx-10.9-x86_64-2.7/var/folders/24/8k48jl6d249_n_qfxwsl6xvm0000gn
30:     creating build/temp.macosx-10.9-x86_64-2.7/var/folders/24/8k48jl6d249_n_qfxwsl6xvm0000gn/T
30:     cc -c /var/folders/24/8k48jl6d249_n_qfxwsl6xvm0000gn/T/sasl_client_donepupSxp.c -o build/temp.macosx-10.9-x86_64-2.7/var/folders/24/8k48jl6d249_n_qfxwsl6xvm0000gn/T/sasl_client_donepupSxp.o
30:     cc build/temp.macosx-10.9-x86_64-2.7/var/folders/24/8k48jl6d249_n_qfxwsl6xvm0000gn/T/sasl_client_donepupSxp.o -lsasl2 -o build/temp.macosx-10.9-x86_64-2.7/a.out
30:     creating build/temp.macosx-10.9-x86_64-2.7/private
30:     creating build/temp.macosx-10.9-x86_64-2.7/private/var
30:     creating build/temp.macosx-10.9-x86_64-2.7/private/var/folders
30:     creating build/temp.macosx-10.9-x86_64-2.7/private/var/folders/24
30:     creating build/temp.macosx-10.9-x86_64-2.7/private/var/folders/24/8k48jl6d249_n_qfxwsl6xvm0000gn
30:     creating build/temp.macosx-10.9-x86_64-2.7/private/var/folders/24/8k48jl6d249_n_qfxwsl6xvm0000gn/T
30:     creating build/temp.macosx-10.9-x86_64-2.7/private/var/folders/24/8k48jl6d249_n_qfxwsl6xvm0000gn/T/pip-req-build-3ZaeQ3
30:     creating build/temp.macosx-10.9-x86_64-2.7/private/var/folders/24/8k48jl6d249_n_qfxwsl6xvm0000gn/T/pip-req-build-3ZaeQ3/src
30:     creating build/temp.macosx-10.9-x86_64-2.7/private/var/folders/24/8k48jl6d249_n_qfxwsl6xvm0000gn/T/pip-req-build-3ZaeQ3/src/core
30:     creating build/temp.macosx-10.9-x86_64-2.7/private/var/folders/24/8k48jl6d249_n_qfxwsl6xvm0000gn/T/pip-req-build-3ZaeQ3/src/core/object
30:     creating build/temp.macosx-10.9-x86_64-2.7/private/var/folders/24/8k48jl6d249_n_qfxwsl6xvm0000gn/T/pip-req-build-3ZaeQ3/src/compiler
30:     creating build/temp.macosx-10.9-x86_64-2.7/private/var/folders/24/8k48jl6d249_n_qfxwsl6xvm0000gn/T/pip-req-build-3ZaeQ3/src/compiler/gcc
30:     creating build/temp.macosx-10.9-x86_64-2.7/private/var/folders/24/8k48jl6d249_n_qfxwsl6xvm0000gn/T/pip-req-build-3ZaeQ3/src/ssl
30:     creating build/temp.macosx-10.9-x86_64-2.7/private/var/folders/24/8k48jl6d249_n_qfxwsl6xvm0000gn/T/pip-req-build-3ZaeQ3/src/sasl
30:     gcc -fno-strict-aliasing -fno-common -dynamic -arch x86_64 -g -DNDEBUG -g -fwrapv -O3 -Wall -Wstrict-prototypes -std=gnu99 -DPROTON_DECLARE_STATIC -Ibuild/include -I/private/var/folders/24/8k48jl6d249_n_qfxwsl6xvm0000gn/T/pip-req-build-3ZaeQ3/include -I/private/var/folders/24/8k48jl6d249_n_qfxwsl6xvm0000gn/T/pip-req-build-3ZaeQ3/src -I/usr/local/Cellar/openssl@1.1/1.1.1i/include -c /private/var/folders/24/8k48jl6d249_n_qfxwsl6xvm0000gn/T/pip-req-build-3ZaeQ3/src/core/log.c -o build/temp.macosx-10.9-x86_64-2.7/private/var/folders/24/8k48jl6d249_n_qfxwsl6xvm0000gn/T/pip-req-build-3ZaeQ3/src/core/log.o
30:     gcc -fno-strict-aliasing -fno-common -dynamic -arch x86_64 -g -DNDEBUG -g -fwrapv -O3 -Wall -Wstrict-prototypes -std=gnu99 -DPROTON_DECLARE_STATIC -Ibuild/include -I/private/var/folders/24/8k48jl6d249_n_qfxwsl6xvm0000gn/T/pip-req-build-3ZaeQ3/include -I/private/var/folders/24/8k48jl6d249_n_qfxwsl6xvm0000gn/T/pip-req-build-3ZaeQ3/src -I/usr/local/Cellar/openssl@1.1/1.1.1i/include -c /private/var/folders/24/8k48jl6d249_n_qfxwsl6xvm0000gn/T/pip-req-build-3ZaeQ3/src/core/codec.c -o build/temp.macosx-10.9-x86_64-2.7/private/var/folders/24/8k48jl6d249_n_qfxwsl6xvm0000gn/T/pip-req-build-3ZaeQ3/src/core/codec.o
30:     gcc -fno-strict-aliasing -fno-common -dynamic -arch x86_64 -g -DNDEBUG -g -fwrapv -O3 -Wall -Wstrict-prototypes -std=gnu99 -DPROTON_DECLARE_STATIC -Ibuild/include -I/private/var/folders/24/8k48jl6d249_n_qfxwsl6xvm0000gn/T/pip-req-build-3ZaeQ3/include -I/private/var/folders/24/8k48jl6d249_n_qfxwsl6xvm0000gn/T/pip-req-build-3ZaeQ3/src -I/usr/local/Cellar/openssl@1.1/1.1.1i/include -c /private/var/folders/24/8k48jl6d249_n_qfxwsl6xvm0000gn/T/pip-req-build-3ZaeQ3/src/core/buffer.c -o build/temp.macosx-10.9-x86_64-2.7/private/var/folders/24/8k48jl6d249_n_qfxwsl6xvm0000gn/T/pip-req-build-3ZaeQ3/src/core/buffer.o
30:     gcc -fno-strict-aliasing -fno-common -dynamic -arch x86_64 -g -DNDEBUG -g -fwrapv -O3 -Wall -Wstrict-prototypes -std=gnu99 -DPROTON_DECLARE_STATIC -Ibuild/include -I/private/var/folders/24/8k48jl6d249_n_qfxwsl6xvm0000gn/T/pip-req-build-3ZaeQ3/include -I/private/var/folders/24/8k48jl6d249_n_qfxwsl6xvm0000gn/T/pip-req-build-3ZaeQ3/src -I/usr/local/Cellar/openssl@1.1/1.1.1i/include -c /private/var/folders/24/8k48jl6d249_n_qfxwsl6xvm0000gn/T/pip-req-build-3ZaeQ3/src/core/dispatcher.c -o build/temp.macosx-10.9-x86_64-2.7/private/var/folders/24/8k48jl6d249_n_qfxwsl6xvm0000gn/T/pip-req-build-3ZaeQ3/src/core/dispatcher.o
30:     gcc -fno-strict-aliasing -fno-common -dynamic -arch x86_64 -g -DNDEBUG -g -fwrapv -O3 -Wall -Wstrict-prototypes -std=gnu99 -DPROTON_DECLARE_STATIC -Ibuild/include -I/private/var/folders/24/8k48jl6d249_n_qfxwsl6xvm0000gn/T/pip-req-build-3ZaeQ3/include -I/private/var/folders/24/8k48jl6d249_n_qfxwsl6xvm0000gn/T/pip-req-build-3ZaeQ3/src -I/usr/local/Cellar/openssl@1.1/1.1.1i/include -c /private/var/folders/24/8k48jl6d249_n_qfxwsl6xvm0000gn/T/pip-req-build-3ZaeQ3/src/core/transport.c -o build/temp.macosx-10.9-x86_64-2.7/private/var/folders/24/8k48jl6d249_n_qfxwsl6xvm0000gn/T/pip-req-build-3ZaeQ3/src/core/transport.o
30:     gcc -fno-strict-aliasing -fno-common -dynamic -arch x86_64 -g -DNDEBUG -g -fwrapv -O3 -Wall -Wstrict-prototypes -std=gnu99 -DPROTON_DECLARE_STATIC -Ibuild/include -I/private/var/folders/24/8k48jl6d249_n_qfxwsl6xvm0000gn/T/pip-req-build-3ZaeQ3/include -I/private/var/folders/24/8k48jl6d249_n_qfxwsl6xvm0000gn/T/pip-req-build-3ZaeQ3/src -I/usr/local/Cellar/openssl@1.1/1.1.1i/include -c /private/var/folders/24/8k48jl6d249_n_qfxwsl6xvm0000gn/T/pip-req-build-3ZaeQ3/src/core/memory.c -o build/temp.macosx-10.9-x86_64-2.7/private/var/folders/24/8k48jl6d249_n_qfxwsl6xvm0000gn/T/pip-req-build-3ZaeQ3/src/core/memory.o
30:     gcc -fno-strict-aliasing -fno-common -dynamic -arch x86_64 -g -DNDEBUG -g -fwrapv -O3 -Wall -Wstrict-prototypes -std=gnu99 -DPROTON_DECLARE_STATIC -Ibuild/include -I/private/var/folders/24/8k48jl6d249_n_qfxwsl6xvm0000gn/T/pip-req-build-3ZaeQ3/include -I/private/var/folders/24/8k48jl6d249_n_qfxwsl6xvm0000gn/T/pip-req-build-3ZaeQ3/src -I/usr/local/Cellar/openssl@1.1/1.1.1i/include -c /private/var/folders/24/8k48jl6d249_n_qfxwsl6xvm0000gn/T/pip-req-build-3ZaeQ3/src/core/util.c -o build/temp.macosx-10.9-x86_64-2.7/private/var/folders/24/8k48jl6d249_n_qfxwsl6xvm0000gn/T/pip-req-build-3ZaeQ3/src/core/util.o
30:     gcc -fno-strict-aliasing -fno-common -dynamic -arch x86_64 -g -DNDEBUG -g -fwrapv -O3 -Wall -Wstrict-prototypes -std=gnu99 -DPROTON_DECLARE_STATIC -Ibuild/include -I/private/var/folders/24/8k48jl6d249_n_qfxwsl6xvm0000gn/T/pip-req-build-3ZaeQ3/include -I/private/var/folders/24/8k48jl6d249_n_qfxwsl6xvm0000gn/T/pip-req-build-3ZaeQ3/src -I/usr/local/Cellar/openssl@1.1/1.1.1i/include -c /private/var/folders/24/8k48jl6d249_n_qfxwsl6xvm0000gn/T/pip-req-build-3ZaeQ3/src/core/framing.c -o build/temp.macosx-10.9-x86_64-2.7/private/var/folders/24/8k48jl6d249_n_qfxwsl6xvm0000gn/T/pip-req-build-3ZaeQ3/src/core/framing.o
30:     gcc -fno-strict-aliasing -fno-common -dynamic -arch x86_64 -g -DNDEBUG -g -fwrapv -O3 -Wall -Wstrict-prototypes -std=gnu99 -DPROTON_DECLARE_STATIC -Ibuild/include -I/private/var/folders/24/8k48jl6d249_n_qfxwsl6xvm0000gn/T/pip-req-build-3ZaeQ3/include -I/private/var/folders/24/8k48jl6d249_n_qfxwsl6xvm0000gn/T/pip-req-build-3ZaeQ3/src -I/usr/local/Cellar/openssl@1.1/1.1.1i/include -c /private/var/folders/24/8k48jl6d249_n_qfxwsl6xvm0000gn/T/pip-req-build-3ZaeQ3/src/core/encoder.c -o build/temp.macosx-10.9-x86_64-2.7/private/var/folders/24/8k48jl6d249_n_qfxwsl6xvm0000gn/T/pip-req-build-3ZaeQ3/src/core/encoder.o
30:     gcc -fno-strict-aliasing -fno-common -dynamic -arch x86_64 -g -DNDEBUG -g -fwrapv -O3 -Wall -Wstrict-prototypes -std=gnu99 -DPROTON_DECLARE_STATIC -Ibuild/include -I/private/var/folders/24/8k48jl6d249_n_qfxwsl6xvm0000gn/T/pip-req-build-3ZaeQ3/include -I/private/var/folders/24/8k48jl6d249_n_qfxwsl6xvm0000gn/T/pip-req-build-3ZaeQ3/src -I/usr/local/Cellar/openssl@1.1/1.1.1i/include -c /private/var/folders/24/8k48jl6d249_n_qfxwsl6xvm0000gn/T/pip-req-build-3ZaeQ3/src/core/logger.c -o build/temp.macosx-10.9-x86_64-2.7/private/var/folders/24/8k48jl6d249_n_qfxwsl6xvm0000gn/T/pip-req-build-3ZaeQ3/src/core/logger.o
30:     gcc -fno-strict-aliasing -fno-common -dynamic -arch x86_64 -g -DNDEBUG -g -fwrapv -O3 -Wall -Wstrict-prototypes -std=gnu99 -DPROTON_DECLARE_STATIC -Ibuild/include -I/private/var/folders/24/8k48jl6d249_n_qfxwsl6xvm0000gn/T/pip-req-build-3ZaeQ3/include -I/private/var/folders/24/8k48jl6d249_n_qfxwsl6xvm0000gn/T/pip-req-build-3ZaeQ3/src -I/usr/local/Cellar/openssl@1.1/1.1.1i/include -c /private/var/folders/24/8k48jl6d249_n_qfxwsl6xvm0000gn/T/pip-req-build-3ZaeQ3/src/core/init.c -o build/temp.macosx-10.9-x86_64-2.7/private/var/folders/24/8k48jl6d249_n_qfxwsl6xvm0000gn/T/pip-req-build-3ZaeQ3/src/core/init.o
30:     gcc -fno-strict-aliasing -fno-common -dynamic -arch x86_64 -g -DNDEBUG -g -fwrapv -O3 -Wall -Wstrict-prototypes -std=gnu99 -DPROTON_DECLARE_STATIC -Ibuild/include -I/private/var/folders/24/8k48jl6d249_n_qfxwsl6xvm0000gn/T/pip-req-build-3ZaeQ3/include -I/private/var/folders/24/8k48jl6d249_n_qfxwsl6xvm0000gn/T/pip-req-build-3ZaeQ3/src -I/usr/local/Cellar/openssl@1.1/1.1.1i/include -c /private/var/folders/24/8k48jl6d249_n_qfxwsl6xvm0000gn/T/pip-req-build-3ZaeQ3/src/core/engine.c -o build/temp.macosx-10.9-x86_64-2.7/private/var/folders/24/8k48jl6d249_n_qfxwsl6xvm0000gn/T/pip-req-build-3ZaeQ3/src/core/engine.o
30:     gcc -fno-strict-aliasing -fno-common -dynamic -arch x86_64 -g -DNDEBUG -g -fwrapv -O3 -Wall -Wstrict-prototypes -std=gnu99 -DPROTON_DECLARE_STATIC -Ibuild/include -I/private/var/folders/24/8k48jl6d249_n_qfxwsl6xvm0000gn/T/pip-req-build-3ZaeQ3/include -I/private/var/folders/24/8k48jl6d249_n_qfxwsl6xvm0000gn/T/pip-req-build-3ZaeQ3/src -I/usr/local/Cellar/openssl@1.1/1.1.1i/include -c /private/var/folders/24/8k48jl6d249_n_qfxwsl6xvm0000gn/T/pip-req-build-3ZaeQ3/src/core/error.c -o build/temp.macosx-10.9-x86_64-2.7/private/var/folders/24/8k48jl6d249_n_qfxwsl6xvm0000gn/T/pip-req-build-3ZaeQ3/src/core/error.o
30:     gcc -fno-strict-aliasing -fno-common -dynamic -arch x86_64 -g -DNDEBUG -g -fwrapv -O3 -Wall -Wstrict-prototypes -std=gnu99 -DPROTON_DECLARE_STATIC -Ibuild/include -I/private/var/folders/24/8k48jl6d249_n_qfxwsl6xvm0000gn/T/pip-req-build-3ZaeQ3/include -I/private/var/folders/24/8k48jl6d249_n_qfxwsl6xvm0000gn/T/pip-req-build-3ZaeQ3/src -I/usr/local/Cellar/openssl@1.1/1.1.1i/include -c /private/var/folders/24/8k48jl6d249_n_qfxwsl6xvm0000gn/T/pip-req-build-3ZaeQ3/src/core/event.c -o build/temp.macosx-10.9-x86_64-2.7/private/var/folders/24/8k48jl6d249_n_qfxwsl6xvm0000gn/T/pip-req-build-3ZaeQ3/src/core/event.o
30:     gcc -fno-strict-aliasing -fno-common -dynamic -arch x86_64 -g -DNDEBUG -g -fwrapv -O3 -Wall -Wstrict-prototypes -std=gnu99 -DPROTON_DECLARE_STATIC -Ibuild/include -I/private/var/folders/24/8k48jl6d249_n_qfxwsl6xvm0000gn/T/pip-req-build-3ZaeQ3/include -I/private/var/folders/24/8k48jl6d249_n_qfxwsl6xvm0000gn/T/pip-req-build-3ZaeQ3/src -I/usr/local/Cellar/openssl@1.1/1.1.1i/include -c /private/var/folders/24/8k48jl6d249_n_qfxwsl6xvm0000gn/T/pip-req-build-3ZaeQ3/src/core/types.c -o build/temp.macosx-10.9-x86_64-2.7/private/var/folders/24/8k48jl6d249_n_qfxwsl6xvm0000gn/T/pip-req-build-3ZaeQ3/src/core/types.o
30:     gcc -fno-strict-aliasing -fno-common -dynamic -arch x86_64 -g -DNDEBUG -g -fwrapv -O3 -Wall -Wstrict-prototypes -std=gnu99 -DPROTON_DECLARE_STATIC -Ibuild/include -I/private/var/folders/24/8k48jl6d249_n_qfxwsl6xvm0000gn/T/pip-req-build-3ZaeQ3/include -I/private/var/folders/24/8k48jl6d249_n_qfxwsl6xvm0000gn/T/pip-req-build-3ZaeQ3/src -I/usr/local/Cellar/openssl@1.1/1.1.1i/include -c /private/var/folders/24/8k48jl6d249_n_qfxwsl6xvm0000gn/T/pip-req-build-3ZaeQ3/src/core/decoder.c -o build/temp.macosx-10.9-x86_64-2.7/private/var/folders/24/8k48jl6d249_n_qfxwsl6xvm0000gn/T/pip-req-build-3ZaeQ3/src/core/decoder.o
30:     gcc -fno-strict-aliasing -fno-common -dynamic -arch x86_64 -g -DNDEBUG -g -fwrapv -O3 -Wall -Wstrict-prototypes -std=gnu99 -DPROTON_DECLARE_STATIC -Ibuild/include -I/private/var/folders/24/8k48jl6d249_n_qfxwsl6xvm0000gn/T/pip-req-build-3ZaeQ3/include -I/private/var/folders/24/8k48jl6d249_n_qfxwsl6xvm0000gn/T/pip-req-build-3ZaeQ3/src -I/usr/local/Cellar/openssl@1.1/1.1.1i/include -c /private/var/folders/24/8k48jl6d249_n_qfxwsl6xvm0000gn/T/pip-req-build-3ZaeQ3/src/core/connection_driver.c -o build/temp.macosx-10.9-x86_64-2.7/private/var/folders/24/8k48jl6d249_n_qfxwsl6xvm0000gn/T/pip-req-build-3ZaeQ3/src/core/connection_driver.o
30:     gcc -fno-strict-aliasing -fno-common -dynamic -arch x86_64 -g -DNDEBUG -g -fwrapv -O3 -Wall -Wstrict-prototypes -std=gnu99 -DPROTON_DECLARE_STATIC -Ibuild/include -I/private/var/folders/24/8k48jl6d249_n_qfxwsl6xvm0000gn/T/pip-req-build-3ZaeQ3/include -I/private/var/folders/24/8k48jl6d249_n_qfxwsl6xvm0000gn/T/pip-req-build-3ZaeQ3/src -I/usr/local/Cellar/openssl@1.1/1.1.1i/include -c /private/var/folders/24/8k48jl6d249_n_qfxwsl6xvm0000gn/T/pip-req-build-3ZaeQ3/src/core/autodetect.c -o build/temp.macosx-10.9-x86_64-2.7/private/var/folders/24/8k48jl6d249_n_qfxwsl6xvm0000gn/T/pip-req-build-3ZaeQ3/src/core/autodetect.o
30:     gcc -fno-strict-aliasing -fno-common -dynamic -arch x86_64 -g -DNDEBUG -g -fwrapv -O3 -Wall -Wstrict-prototypes -std=gnu99 -DPROTON_DECLARE_STATIC -Ibuild/include -I/private/var/folders/24/8k48jl6d249_n_qfxwsl6xvm0000gn/T/pip-req-build-3ZaeQ3/include -I/private/var/folders/24/8k48jl6d249_n_qfxwsl6xvm0000gn/T/pip-req-build-3ZaeQ3/src -I/usr/local/Cellar/openssl@1.1/1.1.1i/include -c /private/var/folders/24/8k48jl6d249_n_qfxwsl6xvm0000gn/T/pip-req-build-3ZaeQ3/src/core/message.c -o build/temp.macosx-10.9-x86_64-2.7/private/var/folders/24/8k48jl6d249_n_qfxwsl6xvm0000gn/T/pip-req-build-3ZaeQ3/src/core/message.o
30:     gcc -fno-strict-aliasing -fno-common -dynamic -arch x86_64 -g -DNDEBUG -g -fwrapv -O3 -Wall -Wstrict-prototypes -std=gnu99 -DPROTON_DECLARE_STATIC -Ibuild/include -I/private/var/folders/24/8k48jl6d249_n_qfxwsl6xvm0000gn/T/pip-req-build-3ZaeQ3/include -I/private/var/folders/24/8k48jl6d249_n_qfxwsl6xvm0000gn/T/pip-req-build-3ZaeQ3/src -I/usr/local/Cellar/openssl@1.1/1.1.1i/include -c /private/var/folders/24/8k48jl6d249_n_qfxwsl6xvm0000gn/T/pip-req-build-3ZaeQ3/src/core/object/list.c -o build/temp.macosx-10.9-x86_64-2.7/private/var/folders/24/8k48jl6d249_n_qfxwsl6xvm0000gn/T/pip-req-build-3ZaeQ3/src/core/object/list.o
30:     gcc -fno-strict-aliasing -fno-common -dynamic -arch x86_64 -g -DNDEBUG -g -fwrapv -O3 -Wall -Wstrict-prototypes -std=gnu99 -DPROTON_DECLARE_STATIC -Ibuild/include -I/private/var/folders/24/8k48jl6d249_n_qfxwsl6xvm0000gn/T/pip-req-build-3ZaeQ3/include -I/private/var/folders/24/8k48jl6d249_n_qfxwsl6xvm0000gn/T/pip-req-build-3ZaeQ3/src -I/usr/local/Cellar/openssl@1.1/1.1.1i/include -c /private/var/folders/24/8k48jl6d249_n_qfxwsl6xvm0000gn/T/pip-req-build-3ZaeQ3/src/core/object/object.c -o build/temp.macosx-10.9-x86_64-2.7/private/var/folders/24/8k48jl6d249_n_qfxwsl6xvm0000gn/T/pip-req-build-3ZaeQ3/src/core/object/object.o
30:     gcc -fno-strict-aliasing -fno-common -dynamic -arch x86_64 -g -DNDEBUG -g -fwrapv -O3 -Wall -Wstrict-prototypes -std=gnu99 -DPROTON_DECLARE_STATIC -Ibuild/include -I/private/var/folders/24/8k48jl6d249_n_qfxwsl6xvm0000gn/T/pip-req-build-3ZaeQ3/include -I/private/var/folders/24/8k48jl6d249_n_qfxwsl6xvm0000gn/T/pip-req-build-3ZaeQ3/src -I/usr/local/Cellar/openssl@1.1/1.1.1i/include -c /private/var/folders/24/8k48jl6d249_n_qfxwsl6xvm0000gn/T/pip-req-build-3ZaeQ3/src/core/object/string.c -o build/temp.macosx-10.9-x86_64-2.7/private/var/folders/24/8k48jl6d249_n_qfxwsl6xvm0000gn/T/pip-req-build-3ZaeQ3/src/core/object/string.o
30:     gcc -fno-strict-aliasing -fno-common -dynamic -arch x86_64 -g -DNDEBUG -g -fwrapv -O3 -Wall -Wstrict-prototypes -std=gnu99 -DPROTON_DECLARE_STATIC -Ibuild/include -I/private/var/folders/24/8k48jl6d249_n_qfxwsl6xvm0000gn/T/pip-req-build-3ZaeQ3/include -I/private/var/folders/24/8k48jl6d249_n_qfxwsl6xvm0000gn/T/pip-req-build-3ZaeQ3/src -I/usr/local/Cellar/openssl@1.1/1.1.1i/include -c /private/var/folders/24/8k48jl6d249_n_qfxwsl6xvm0000gn/T/pip-req-build-3ZaeQ3/src/core/object/iterator.c -o build/temp.macosx-10.9-x86_64-2.7/private/var/folders/24/8k48jl6d249_n_qfxwsl6xvm0000gn/T/pip-req-build-3ZaeQ3/src/core/object/iterator.o
30:     gcc -fno-strict-aliasing -fno-common -dynamic -arch x86_64 -g -DNDEBUG -g -fwrapv -O3 -Wall -Wstrict-prototypes -std=gnu99 -DPROTON_DECLARE_STATIC -Ibuild/include -I/private/var/folders/24/8k48jl6d249_n_qfxwsl6xvm0000gn/T/pip-req-build-3ZaeQ3/include -I/private/var/folders/24/8k48jl6d249_n_qfxwsl6xvm0000gn/T/pip-req-build-3ZaeQ3/src -I/usr/local/Cellar/openssl@1.1/1.1.1i/include -c /private/var/folders/24/8k48jl6d249_n_qfxwsl6xvm0000gn/T/pip-req-build-3ZaeQ3/src/core/object/map.c -o build/temp.macosx-10.9-x86_64-2.7/private/var/folders/24/8k48jl6d249_n_qfxwsl6xvm0000gn/T/pip-req-build-3ZaeQ3/src/core/object/map.o
30:     gcc -fno-strict-aliasing -fno-common -dynamic -arch x86_64 -g -DNDEBUG -g -fwrapv -O3 -Wall -Wstrict-prototypes -std=gnu99 -DPROTON_DECLARE_STATIC -Ibuild/include -I/private/var/folders/24/8k48jl6d249_n_qfxwsl6xvm0000gn/T/pip-req-build-3ZaeQ3/include -I/private/var/folders/24/8k48jl6d249_n_qfxwsl6xvm0000gn/T/pip-req-build-3ZaeQ3/src -I/usr/local/Cellar/openssl@1.1/1.1.1i/include -c /private/var/folders/24/8k48jl6d249_n_qfxwsl6xvm0000gn/T/pip-req-build-3ZaeQ3/src/core/object/record.c -o build/temp.macosx-10.9-x86_64-2.7/private/var/folders/24/8k48jl6d249_n_qfxwsl6xvm0000gn/T/pip-req-build-3ZaeQ3/src/core/object/record.o
30:     gcc -fno-strict-aliasing -fno-common -dynamic -arch x86_64 -g -DNDEBUG -g -fwrapv -O3 -Wall -Wstrict-prototypes -std=gnu99 -DPROTON_DECLARE_STATIC -Ibuild/include -I/private/var/folders/24/8k48jl6d249_n_qfxwsl6xvm0000gn/T/pip-req-build-3ZaeQ3/include -I/private/var/folders/24/8k48jl6d249_n_qfxwsl6xvm0000gn/T/pip-req-build-3ZaeQ3/src -I/usr/local/Cellar/openssl@1.1/1.1.1i/include -c /private/var/folders/24/8k48jl6d249_n_qfxwsl6xvm0000gn/T/pip-req-build-3ZaeQ3/src/compiler/gcc/start.c -o build/temp.macosx-10.9-x86_64-2.7/private/var/folders/24/8k48jl6d249_n_qfxwsl6xvm0000gn/T/pip-req-build-3ZaeQ3/src/compiler/gcc/start.o
30:     gcc -fno-strict-aliasing -fno-common -dynamic -arch x86_64 -g -DNDEBUG -g -fwrapv -O3 -Wall -Wstrict-prototypes -std=gnu99 -DPROTON_DECLARE_STATIC -Ibuild/include -I/private/var/folders/24/8k48jl6d249_n_qfxwsl6xvm0000gn/T/pip-req-build-3ZaeQ3/include -I/private/var/folders/24/8k48jl6d249_n_qfxwsl6xvm0000gn/T/pip-req-build-3ZaeQ3/src -I/usr/local/Cellar/openssl@1.1/1.1.1i/include -c /private/var/folders/24/8k48jl6d249_n_qfxwsl6xvm0000gn/T/pip-req-build-3ZaeQ3/src/ssl/openssl.c -o build/temp.macosx-10.9-x86_64-2.7/private/var/folders/24/8k48jl6d249_n_qfxwsl6xvm0000gn/T/pip-req-build-3ZaeQ3/src/ssl/openssl.o
30:     gcc -fno-strict-aliasing -fno-common -dynamic -arch x86_64 -g -DNDEBUG -g -fwrapv -O3 -Wall -Wstrict-prototypes -std=gnu99 -DPROTON_DECLARE_STATIC -Ibuild/include -I/private/var/folders/24/8k48jl6d249_n_qfxwsl6xvm0000gn/T/pip-req-build-3ZaeQ3/include -I/private/var/folders/24/8k48jl6d249_n_qfxwsl6xvm0000gn/T/pip-req-build-3ZaeQ3/src -I/usr/local/Cellar/openssl@1.1/1.1.1i/include -c /private/var/folders/24/8k48jl6d249_n_qfxwsl6xvm0000gn/T/pip-req-build-3ZaeQ3/src/sasl/sasl.c -o build/temp.macosx-10.9-x86_64-2.7/private/var/folders/24/8k48jl6d249_n_qfxwsl6xvm0000gn/T/pip-req-build-3ZaeQ3/src/sasl/sasl.o
30:     gcc -fno-strict-aliasing -fno-common -dynamic -arch x86_64 -g -DNDEBUG -g -fwrapv -O3 -Wall -Wstrict-prototypes -std=gnu99 -DPROTON_DECLARE_STATIC -Ibuild/include -I/private/var/folders/24/8k48jl6d249_n_qfxwsl6xvm0000gn/T/pip-req-build-3ZaeQ3/include -I/private/var/folders/24/8k48jl6d249_n_qfxwsl6xvm0000gn/T/pip-req-build-3ZaeQ3/src -I/usr/local/Cellar/openssl@1.1/1.1.1i/include -c /private/var/folders/24/8k48jl6d249_n_qfxwsl6xvm0000gn/T/pip-req-build-3ZaeQ3/src/sasl/default_sasl.c -o build/temp.macosx-10.9-x86_64-2.7/private/var/folders/24/8k48jl6d249_n_qfxwsl6xvm0000gn/T/pip-req-build-3ZaeQ3/src/sasl/default_sasl.o
30:     gcc -fno-strict-aliasing -fno-common -dynamic -arch x86_64 -g -DNDEBUG -g -fwrapv -O3 -Wall -Wstrict-prototypes -std=gnu99 -DPROTON_DECLARE_STATIC -Ibuild/include -I/private/var/folders/24/8k48jl6d249_n_qfxwsl6xvm0000gn/T/pip-req-build-3ZaeQ3/include -I/private/var/folders/24/8k48jl6d249_n_qfxwsl6xvm0000gn/T/pip-req-build-3ZaeQ3/src -I/usr/local/Cellar/openssl@1.1/1.1.1i/include -c /private/var/folders/24/8k48jl6d249_n_qfxwsl6xvm0000gn/T/pip-req-build-3ZaeQ3/src/sasl/cyrus_sasl.c -o build/temp.macosx-10.9-x86_64-2.7/private/var/folders/24/8k48jl6d249_n_qfxwsl6xvm0000gn/T/pip-req-build-3ZaeQ3/src/sasl/cyrus_sasl.o
30:     building '_cproton' extension
30:     gcc -fno-strict-aliasing -fno-common -dynamic -arch x86_64 -g -DNDEBUG -g -fwrapv -O3 -Wall -Wstrict-prototypes -Ibuild/include -I/private/var/folders/24/8k48jl6d249_n_qfxwsl6xvm0000gn/T/pip-req-build-3ZaeQ3/include -I/Users/runner/work/qpid-proton/qpid-proton/BLD/python/.tox/py27/include/python2.7 -c cproton_wrap.c -o build/temp.macosx-10.9-x86_64-2.7/cproton_wrap.o -DPROTON_DECLARE_STATIC
30:     cproton_wrap.c:5981:12: warning: unused function 'check_state' [-Wunused-function]
30:     static int check_state(int x) {
30:                ^
30:     cproton_wrap.c:5992:12: warning: unused function 'check_disposition' [-Wunused-function]
30:     static int check_disposition(int x) {
30:                ^
30:     cproton_wrap.c:6003:12: warning: unused function 'check_trace' [-Wunused-function]
30:     static int check_trace(int x) {
30:                ^
30:     3 warnings generated.
30:     creating build/lib.macosx-10.9-x86_64-2.7
30:     gcc -bundle -undefined dynamic_lookup -arch x86_64 -g build/temp.macosx-10.9-x86_64-2.7/cproton_wrap.o build/temp.macosx-10.9-x86_64-2.7/private/var/folders/24/8k48jl6d249_n_qfxwsl6xvm0000gn/T/pip-req-build-3ZaeQ3/src/core/log.o build/temp.macosx-10.9-x86_64-2.7/private/var/folders/24/8k48jl6d249_n_qfxwsl6xvm0000gn/T/pip-req-build-3ZaeQ3/src/core/codec.o build/temp.macosx-10.9-x86_64-2.7/private/var/folders/24/8k48jl6d249_n_qfxwsl6xvm0000gn/T/pip-req-build-3ZaeQ3/src/core/buffer.o build/temp.macosx-10.9-x86_64-2.7/private/var/folders/24/8k48jl6d249_n_qfxwsl6xvm0000gn/T/pip-req-build-3ZaeQ3/src/core/dispatcher.o build/temp.macosx-10.9-x86_64-2.7/private/var/folders/24/8k48jl6d249_n_qfxwsl6xvm0000gn/T/pip-req-build-3ZaeQ3/src/core/transport.o build/temp.macosx-10.9-x86_64-2.7/private/var/folders/24/8k48jl6d249_n_qfxwsl6xvm0000gn/T/pip-req-build-3ZaeQ3/src/core/memory.o build/temp.macosx-10.9-x86_64-2.7/private/var/folders/24/8k48jl6d249_n_qfxwsl6xvm0000gn/T/pip-req-build-3ZaeQ3/src/core/util.o build/temp.macosx-10.9-x86_64-2.7/private/var/folders/24/8k48jl6d249_n_qfxwsl6xvm0000gn/T/pip-req-build-3ZaeQ3/src/core/framing.o build/temp.macosx-10.9-x86_64-2.7/private/var/folders/24/8k48jl6d249_n_qfxwsl6xvm0000gn/T/pip-req-build-3ZaeQ3/src/core/encoder.o build/temp.macosx-10.9-x86_64-2.7/private/var/folders/24/8k48jl6d249_n_qfxwsl6xvm0000gn/T/pip-req-build-3ZaeQ3/src/core/logger.o build/temp.macosx-10.9-x86_64-2.7/private/var/folders/24/8k48jl6d249_n_qfxwsl6xvm0000gn/T/pip-req-build-3ZaeQ3/src/core/init.o build/temp.macosx-10.9-x86_64-2.7/private/var/folders/24/8k48jl6d249_n_qfxwsl6xvm0000gn/T/pip-req-build-3ZaeQ3/src/core/engine.o build/temp.macosx-10.9-x86_64-2.7/private/var/folders/24/8k48jl6d249_n_qfxwsl6xvm0000gn/T/pip-req-build-3ZaeQ3/src/core/error.o build/temp.macosx-10.9-x86_64-2.7/private/var/folders/24/8k48jl6d249_n_qfxwsl6xvm0000gn/T/pip-req-build-3ZaeQ3/src/core/event.o build/temp.macosx-10.9-x86_64-2.7/private/var/folders/24/8k48jl6d249_n_qfxwsl6xvm0000gn/T/pip-req-build-3ZaeQ3/src/core/types.o build/temp.macosx-10.9-x86_64-2.7/private/var/folders/24/8k48jl6d249_n_qfxwsl6xvm0000gn/T/pip-req-build-3ZaeQ3/src/core/decoder.o build/temp.macosx-10.9-x86_64-2.7/private/var/folders/24/8k48jl6d249_n_qfxwsl6xvm0000gn/T/pip-req-build-3ZaeQ3/src/core/connection_driver.o build/temp.macosx-10.9-x86_64-2.7/private/var/folders/24/8k48jl6d249_n_qfxwsl6xvm0000gn/T/pip-req-build-3ZaeQ3/src/core/autodetect.o build/temp.macosx-10.9-x86_64-2.7/private/var/folders/24/8k48jl6d249_n_qfxwsl6xvm0000gn/T/pip-req-build-3ZaeQ3/src/core/message.o build/temp.macosx-10.9-x86_64-2.7/private/var/folders/24/8k48jl6d249_n_qfxwsl6xvm0000gn/T/pip-req-build-3ZaeQ3/src/core/object/list.o build/temp.macosx-10.9-x86_64-2.7/private/var/folders/24/8k48jl6d249_n_qfxwsl6xvm0000gn/T/pip-req-build-3ZaeQ3/src/core/object/object.o build/temp.macosx-10.9-x86_64-2.7/private/var/folders/24/8k48jl6d249_n_qfxwsl6xvm0000gn/T/pip-req-build-3ZaeQ3/src/core/object/string.o build/temp.macosx-10.9-x86_64-2.7/private/var/folders/24/8k48jl6d249_n_qfxwsl6xvm0000gn/T/pip-req-build-3ZaeQ3/src/core/object/iterator.o build/temp.macosx-10.9-x86_64-2.7/private/var/folders/24/8k48jl6d249_n_qfxwsl6xvm0000gn/T/pip-req-build-3ZaeQ3/src/core/object/map.o build/temp.macosx-10.9-x86_64-2.7/private/var/folders/24/8k48jl6d249_n_qfxwsl6xvm0000gn/T/pip-req-build-3ZaeQ3/src/core/object/record.o build/temp.macosx-10.9-x86_64-2.7/private/var/folders/24/8k48jl6d249_n_qfxwsl6xvm0000gn/T/pip-req-build-3ZaeQ3/src/compiler/gcc/start.o build/temp.macosx-10.9-x86_64-2.7/private/var/folders/24/8k48jl6d249_n_qfxwsl6xvm0000gn/T/pip-req-build-3ZaeQ3/src/ssl/openssl.o build/temp.macosx-10.9-x86_64-2.7/private/var/folders/24/8k48jl6d249_n_qfxwsl6xvm0000gn/T/pip-req-build-3ZaeQ3/src/sasl/sasl.o build/temp.macosx-10.9-x86_64-2.7/private/var/folders/24/8k48jl6d249_n_qfxwsl6xvm0000gn/T/pip-req-build-3ZaeQ3/src/sasl/default_sasl.o build/temp.macosx-10.9-x86_64-2.7/private/var/folders/24/8k48jl6d249_n_qfxwsl6xvm0000gn/T/pip-req-build-3ZaeQ3/src/sasl/cyrus_sasl.o -lssl -lcrypto -lsasl2 -o build/lib.macosx-10.9-x86_64-2.7/_cproton.so
30:     ld: library not found for -lssl
30:     clang: error: linker command failed with exit code 1 (use -v to see invocation)
30:     error: command 'gcc' failed with exit status 1
30:     ----------------------------------------
30: ERROR: Command errored out with exit status 1: /Users/runner/work/qpid-proton/qpid-proton/BLD/python/.tox/py27/bin/python -u -c 'import sys, setuptools, tokenize; sys.argv[0] = '"'"'/private/var/folders/24/8k48jl6d249_n_qfxwsl6xvm0000gn/T/pip-req-build-3ZaeQ3/setup.py'"'"'; __file__='"'"'/private/var/folders/24/8k48jl6d249_n_qfxwsl6xvm0000gn/T/pip-req-build-3ZaeQ3/setup.py'"'"';f=getattr(tokenize, '"'"'open'"'"', open)(__file__);code=f.read().replace('"'"'\r\n'"'"', '"'"'\n'"'"');f.close();exec(compile(code, __file__, '"'"'exec'"'"'))' install --record /private/var/folders/24/8k48jl6d249_n_qfxwsl6xvm0000gn/T/pip-record-Rnf6gx/install-record.txt --single-version-externally-managed --compile --install-headers /Users/runner/work/qpid-proton/qpid-proton/BLD/python/.tox/py27/include/site/python2.7/python-qpid-proton Check the logs for full command output.
30:
30: =================================== log end ====================================
30: py35 create: /Users/runner/work/qpid-proton/qpid-proton/BLD/python/.tox/py35
30: SKIPPED: InterpreterNotFound: python3.5
30: py36 create: /Users/runner/work/qpid-proton/qpid-proton/BLD/python/.tox/py36
30: py36 inst: /Users/runner/work/qpid-proton/qpid-proton/BLD/python/.tox/.tmp/package/1/python-qpid-proton-0.34.0.zip
30: py36 installed: python-qpid-proton @ file:///Users/runner/work/qpid-proton/qpid-proton/BLD/python/.tox/.tmp/package/1/python-qpid-proton-0.34.0.zip
30: py36 run-test-pre: PYTHONHASHSEED='2517940550'
30: py36 run-test: commands[0] | python /Users/runner/work/qpid-proton/qpid-proton/python/tests/proton-test --ignore-file /Users/runner/work/qpid-proton/qpid-proton/python/tests/tox-blacklist
30: proton_tests.codec.DataTest.testAnnotationDict .......................... pass
30: proton_tests.codec.DataTest.testAnnotationDictNoRaiseError .............. pass
30: proton_tests.codec.DataTest.testBinary .................................. pass
30: proton_tests.codec.DataTest.testBuffer .................................. pass
30: proton_tests.codec.DataTest.testByte .................................... pass
30: proton_tests.codec.DataTest.testByteArray ............................... pass
30: proton_tests.codec.DataTest.testChar .................................... pass
30: proton_tests.codec.DataTest.testCopy .................................... pass
30: proton_tests.codec.DataTest.testCopyNested .............................. pass
30: proton_tests.codec.DataTest.testCopyNestedArray ......................... pass
30: proton_tests.codec.DataTest.testDecimal128 .............................. pass
30: proton_tests.codec.DataTest.testDecimal32 ............................... pass
30: proton_tests.codec.DataTest.testDecimal64 ............................... pass
30: proton_tests.codec.DataTest.testDescribedEmptyArray ..................... pass
30: proton_tests.codec.DataTest.testDescribedStringArray .................... pass
30: proton_tests.codec.DataTest.testDouble .................................. pass
30: proton_tests.codec.DataTest.testEmptyArray .............................. pass
30: proton_tests.codec.DataTest.testEnterExit ............................... pass
30: proton_tests.codec.DataTest.testFloat ................................... pass
30: proton_tests.codec.DataTest.testInt ..................................... pass
30: proton_tests.codec.DataTest.testIntArray ................................ pass
30: proton_tests.codec.DataTest.testLong .................................... pass
30: proton_tests.codec.DataTest.testLongArray ............................... pass
30: proton_tests.codec.DataTest.testLookup .................................. pass
30: proton_tests.codec.DataTest.testMemoryView .............................. pass
30: proton_tests.codec.DataTest.testNestedNext .............................. pass
30: proton_tests.codec.DataTest.testPropertyDict ............................ pass
30: proton_tests.codec.DataTest.testPropertyDictNoRaiseError ................ pass
30: proton_tests.codec.DataTest.testRoundTrip ............................... pass
30: proton_tests.codec.DataTest.testShort ................................... pass
30: proton_tests.codec.DataTest.testShortArray .............................. pass
30: proton_tests.codec.DataTest.testString .................................. pass
30: proton_tests.codec.DataTest.testStringArray ............................. pass
30: proton_tests.codec.DataTest.testSymbol .................................. pass
30: proton_tests.codec.DataTest.testSymbolList .............................. pass
30: proton_tests.codec.DataTest.testSymbolListNoRaiseError .................. pass
30: proton_tests.codec.DataTest.testTimestamp ............................... pass
30: proton_tests.codec.DataTest.testTopLevelNext ............................ pass
30: proton_tests.codec.DataTest.testUUID .................................... pass
30: proton_tests.codec.DataTest.testUUIDArray ............................... pass
30: proton_tests.codec.DataTest.testUbyte ................................... pass
30: proton_tests.codec.DataTest.testUbyteArray .............................. pass
30: proton_tests.codec.DataTest.testUint .................................... pass
30: proton_tests.codec.DataTest.testUintArray ............................... pass
30: proton_tests.codec.DataTest.testUlong ................................... pass
30: proton_tests.codec.DataTest.testUlongArray .............................. pass
30: proton_tests.codec.DataTest.testUshort .................................. pass
30: proton_tests.codec.DataTest.testUshortArray ............................. pass
30: proton_tests.connect.ConnectConfigTest.test_port ........................ skip
30:   proton_tests.common.Skipped: Can't Test Extended SASL: Couldn't create auth db
30: proton_tests.connect.ConnectConfigTest.test_ssl ......................... skip
30:   proton_tests.common.Skipped: Can't Test Extended SASL: Couldn't create auth db
30: proton_tests.connect.ConnectConfigTest.test_ssl_external ................ skip
30:   proton_tests.common.Skipped: Can't Test Extended SASL: Couldn't create auth db
30: proton_tests.connect.ConnectConfigTest.test_ssl_plain ................... skip
30:   proton_tests.common.Skipped: Can't Test Extended SASL: Couldn't create auth db
30: proton_tests.connect.ConnectConfigTest.test_user ........................ skip
30:   proton_tests.common.Skipped: Can't Test Extended SASL: Couldn't create auth db
30: proton_tests.engine.ConnectionTest.test_capabilities_array .............. pass
30: proton_tests.engine.ConnectionTest.test_capabilities_symbol_list ........ pass
30: proton_tests.engine.ConnectionTest.test_channel_max_high ................ pass
30: proton_tests.engine.ConnectionTest.test_channel_max_limits_sessions ..... skip
30:   proton_tests.common.Skipped: Test fails - PROTON-1759
30: proton_tests.engine.ConnectionTest.test_channel_max_low ................. pass
30: proton_tests.engine.ConnectionTest.test_channel_max_raise_and_lower .....[0x7f9a51485ff0]: AMQP:WARNING:Cannot change local channel-max after OPEN frame sent.
30:  pass
30: proton_tests.engine.ConnectionTest.test_cleanup ......................... pass
30: proton_tests.engine.ConnectionTest.test_condition ....................... pass
30: proton_tests.engine.ConnectionTest.test_open_close ...................... pass
30: proton_tests.engine.ConnectionTest.test_properties ...................... pass
30: proton_tests.engine.ConnectionTest.test_simultaneous_open_close ......... pass
30: proton_tests.engine.ConnectionTest.test_user_config ..................... pass
30: proton_tests.engine.CreditTest.testBufferingOnCloseConnectionConnection . pass
30: proton_tests.engine.CreditTest.testBufferingOnCloseConnectionLink ....... pass
30: proton_tests.engine.CreditTest.testBufferingOnCloseConnectionSession .... pass
30: proton_tests.engine.CreditTest.testBufferingOnCloseLinkConnection ....... pass
30: proton_tests.engine.CreditTest.testBufferingOnCloseLinkLink ............. pass
30: proton_tests.engine.CreditTest.testBufferingOnCloseLinkSession .......... pass
30: proton_tests.engine.CreditTest.testBufferingOnCloseSessionConnection .... pass
30: proton_tests.engine.CreditTest.testBufferingOnCloseSessionLink .......... pass
30: proton_tests.engine.CreditTest.testBufferingOnCloseSessionSession ....... pass
30: proton_tests.engine.CreditTest.testCreditReceiver ....................... pass
30: proton_tests.engine.CreditTest.testCreditSender ......................... pass
30: proton_tests.engine.CreditTest.testDrainFlow ............................ pass
30: proton_tests.engine.CreditTest.testDrainOrder ........................... pass
30: proton_tests.engine.CreditTest.testDrainZero ............................ pass
30: proton_tests.engine.CreditTest.testFullDrain ............................ pass
30: proton_tests.engine.CreditTest.testHeadOfLineBlocking ................... pass
30: proton_tests.engine.CreditTest.testNegative ............................. pass
30: proton_tests.engine.CreditTest.testPartialDrain ......................... pass
30: proton_tests.engine.CreditTest.testPushback ............................. pass
30: proton_tests.engine.DeliverySegFaultTest.testDeliveryAfterUnbind ........ pass
30: proton_tests.engine.DeliveryTest.testCustom ............................. pass
30: proton_tests.engine.DeliveryTest.testDisposition ........................ pass
30: proton_tests.engine.DeliveryTest.testModified ........................... pass
30: proton_tests.engine.DeliveryTest.testReceived ........................... pass
30: proton_tests.engine.DeliveryTest.testRejected ........................... pass
30: proton_tests.engine.DeliveryTest.testReleased ........................... pass
30: proton_tests.engine.EventTest.testConnectionBOUND_UNBOUND ............... pass
30: proton_tests.engine.EventTest.testConnectionINIT_FINAL .................. pass
30: proton_tests.engine.EventTest.testDeliveryEvents ........................ pass
30: proton_tests.engine.EventTest.testDeliveryEventsDisp .................... pass
30: proton_tests.engine.EventTest.testEndpointEvents ........................ pass
30: proton_tests.engine.EventTest.testFlowEvents ............................ pass
30: proton_tests.engine.EventTest.testLinkDetach ............................ pass
30: proton_tests.engine.EventTest.testLinkINIT_FINAL ........................ pass
30: proton_tests.engine.EventTest.testSessionINIT_FINAL ..................... pass
30: proton_tests.engine.EventTest.testTransportCLOSED ....................... pass
30: proton_tests.engine.EventTest.testTransportERROR_CLOSE .................. pass
30: proton_tests.engine.IdleTimeoutEventTest.testTimeoutWithZombieServer .... pass
30: proton_tests.engine.IdleTimeoutEventTest. \
30:     testTimeoutWithZombieServerAndSASL .................................. pass
30: proton_tests.engine.IdleTimeoutTest.testGetSet .......................... pass
30: proton_tests.engine.IdleTimeoutTest.testTimeout ......................... pass
30: proton_tests.engine.LinkTest.test_cleanup ............................... pass
30: proton_tests.engine.LinkTest.test_closing_connection .................... pass
30: proton_tests.engine.LinkTest.test_closing_session ....................... pass
30: proton_tests.engine.LinkTest.test_condition ............................. pass
30: proton_tests.engine.LinkTest.test_coordinator ........................... pass
30: proton_tests.engine.LinkTest.test_distribution_mode ..................... pass
30: proton_tests.engine.LinkTest.test_dynamic_link .......................... pass
30: proton_tests.engine.LinkTest.test_max_message_size ...................... pass
30: proton_tests.engine.LinkTest.test_multiple .............................. pass
30: proton_tests.engine.LinkTest.test_open_close ............................ pass
30: proton_tests.engine.LinkTest.test_properties ............................ pass
30: proton_tests.engine.LinkTest.test_settle_mode ........................... pass
30: proton_tests.engine.LinkTest.test_simultaneous_open_close ............... pass
30: proton_tests.engine.LinkTest.test_source ................................ pass
30: proton_tests.engine.LinkTest.test_source_target ......................... pass
30: proton_tests.engine.LinkTest.test_source_target_full .................... pass
30: proton_tests.engine.LinkTest.test_target ................................ pass
30: proton_tests.engine.MaxFrameTransferTest.testBigMessage ................. pass
30: proton_tests.engine.MaxFrameTransferTest.testMaxFrameAbort .............. pass
30: proton_tests.engine.MaxFrameTransferTest.testMinFrame ................... pass
30: proton_tests.engine.MaxFrameTransferTest.testOddFrame ................... pass
30: proton_tests.engine.MaxFrameTransferTest. \
30:     testSendQueuedMultiFrameMessages .................................... pass
30: proton_tests.engine.MaxFrameTransferTest. \
30:     testSendQueuedMultiFrameMessagesThenSingleFrameMessage .............. pass
30: proton_tests.engine.PipelineTest.test ................................... pass
30: proton_tests.engine.SaslEventTest.testAnonymousNoInitialResponse ........ pass
30: proton_tests.engine.SaslEventTest.testPipelinedServerReadFirst .......... pass
30: proton_tests.engine.SaslEventTest.testPipelinedServerWriteFirst ......... pass
30: proton_tests.engine.SessionCreditTest.testBuffering ..................... pass
30: proton_tests.engine.SessionCreditTest.testBufferingSize1023 ............. pass
30: proton_tests.engine.SessionCreditTest.testBufferingSize1025 ............. pass
30: proton_tests.engine.SessionCreditTest.testBufferingSize1059 ............. pass
30: proton_tests.engine.SessionCreditTest.testBufferingSize16 ............... pass
30: proton_tests.engine.SessionCreditTest.testBufferingSize2048 ............. pass
30: proton_tests.engine.SessionCreditTest.testBufferingSize256 .............. pass
30: proton_tests.engine.SessionCreditTest.testBufferingSize512 .............. pass
30: proton_tests.engine.SessionCreditTest.testBufferingSize989 .............. pass
30: proton_tests.engine.SessionCreditTest.testCreditWithBuffering ........... pass
30: proton_tests.engine.SessionTest.test_cleanup ............................ pass
30: proton_tests.engine.SessionTest.test_closing_connection ................. pass
30: proton_tests.engine.SessionTest.test_condition .......................... pass
30: proton_tests.engine.SessionTest.test_open_close ......................... pass
30: proton_tests.engine.SessionTest. \
30:     test_reopen_on_same_session_without_free ............................ pass
30: proton_tests.engine.SessionTest.test_set_get_outgoing_window ............ pass
30: proton_tests.engine.SessionTest.test_simultaneous_close ................. pass
30: proton_tests.engine.SettlementTest.testMultipleUnsettled ................ pass
30: proton_tests.engine.SettlementTest.testMultipleUnsettled1K2K ............ pass
30: proton_tests.engine.SettlementTest.testMultipleUnsettled2K1K ............ pass
30: proton_tests.engine.SettlementTest.testMultipleUnsettled2K2K ............ pass
30: proton_tests.engine.SettlementTest.testMultipleUnsettled4K1K ............ pass
30: proton_tests.engine.SettlementTest.testMultipleUnsettled4K2K ............ pass
30: proton_tests.engine.SettlementTest.testSettleCurrent .................... pass
30: proton_tests.engine.SettlementTest.testUnsettled ........................ pass
30: proton_tests.engine.TeardownLeakTest.testLeak ........................... pass
30: proton_tests.engine.TeardownLeakTest.testLocalLeak ...................... pass
30: proton_tests.engine.TeardownLeakTest.testLocalRemoteLeak ................ pass
30: proton_tests.engine.TeardownLeakTest.testRemoteLeak ..................... pass
30: proton_tests.engine.TransferTest.test_cleanup ........................... pass
30: proton_tests.engine.TransferTest.test_delivery_id_ordering .............. pass
30: proton_tests.engine.TransferTest.test_disposition ....................... pass
30: proton_tests.engine.TransferTest.test_multiframe ........................ pass
30: proton_tests.engine.TransferTest.test_multiframe_abort .................. pass
30: proton_tests.engine.TransferTest.test_multiframe_last_empty ............. pass
30: proton_tests.engine.TransferTest.test_work_queue ........................ pass
30: proton_tests.handler.HandlerTest.test_add_handler ....................... pass
30: proton_tests.handler.HandlerTest.test_add_root .......................... pass
30: proton_tests.handler.HandlerTest.test_append_handler .................... pass
30: proton_tests.handler.HandlerTest.test_append_root ....................... pass
30: proton_tests.handler.HandlerTest.test_reactorHandlerCycling ............. pass
30: proton_tests.handler.HandlerTest.test_reactorHandlerCycling100 .......... pass
30: proton_tests.handler.HandlerTest.test_reactorHandlerCycling10k .......... pass
30: proton_tests.handler.HandlerTest.test_set_handler ....................... pass
30: proton_tests.handler.HandlerTest.test_set_root .......................... pass
30: proton_tests.interop.InteropTest.test_arrays ............................ pass
30: proton_tests.interop.InteropTest.test_described ......................... pass
30: proton_tests.interop.InteropTest.test_described_array ................... pass
30: proton_tests.interop.InteropTest.test_lists ............................. pass
30: proton_tests.interop.InteropTest.test_maps .............................. pass
30: proton_tests.interop.InteropTest.test_message ........................... pass
30: proton_tests.interop.InteropTest.test_primitives ........................ pass
30: proton_tests.interop.InteropTest.test_strings ........................... pass
30: proton_tests.message.AccessorsTest.testAddress .......................... pass
30: proton_tests.message.AccessorsTest.testContentEncoding .................. pass
30: proton_tests.message.AccessorsTest.testContentType ...................... pass
30: proton_tests.message.AccessorsTest.testCorrelationId .................... pass
30: proton_tests.message.AccessorsTest.testCreationTime ..................... pass
30: proton_tests.message.AccessorsTest.testDeliveryCount .................... pass
30: proton_tests.message.AccessorsTest.testDurable .......................... pass
30: proton_tests.message.AccessorsTest.testExpiryTime ....................... pass
30: proton_tests.message.AccessorsTest.testFirstAcquirer .................... pass
30: proton_tests.message.AccessorsTest.testGroupId .......................... pass
30: proton_tests.message.AccessorsTest.testGroupSequence .................... pass
30: proton_tests.message.AccessorsTest.testId ............................... pass
30: proton_tests.message.AccessorsTest.testPriority ......................... pass
30: proton_tests.message.AccessorsTest.testReplyTo .......................... pass
30: proton_tests.message.AccessorsTest.testReplyToGroupId ................... pass
30: proton_tests.message.AccessorsTest.testSubject .......................... pass
30: proton_tests.message.AccessorsTest.testTtl .............................. pass
30: proton_tests.message.AccessorsTest.testUserId ........................... pass
30: proton_tests.message.CodecTest.testAnnotationsSymbolicAndUlongKey ....... pass
30: proton_tests.message.CodecTest.testBinaryPropertyKey .................... pass
30: proton_tests.message.CodecTest.testCharPropertyKey ...................... pass
30: proton_tests.message.CodecTest.testCreationEncodeAsNull ................. pass
30: proton_tests.message.CodecTest.testDecimal128PropertyKey ................ pass
30: proton_tests.message.CodecTest.testDefaultCreationExpiryDecode .......... pass
30: proton_tests.message.CodecTest.testDefaultPriorityDecode ................ pass
30: proton_tests.message.CodecTest.testDefaultPriorityEncode ................ pass
30: proton_tests.message.CodecTest.testExpiryEncodeAsNull ................... pass
30: proton_tests.message.CodecTest.testGroupSequenceEncodeAsNonNull ......... pass
30: proton_tests.message.CodecTest.testGroupSequenceEncodeAsNull ............ pass
30: proton_tests.message.CodecTest.testNonSequencePropertyKeys .............. pass
30: proton_tests.message.CodecTest.testProperties ........................... pass
30: proton_tests.message.CodecTest.testRoundTrip ............................ pass
30: proton_tests.message.CodecTest.testStringSubclassPropertyKey ............ pass
30: proton_tests.message.CodecTest.testSymbolPropertyKey .................... pass
30: proton_tests.reactor.ApplicationEventTest.test_application_events ....... pass
30: proton_tests.reactor.ContainerTest. \
30:     test_authentication_via_container_attributes ........................ skip
30:   proton_tests.common.Skipped: Can't Test Extended SASL: Couldn't create auth db
30: proton_tests.reactor.ContainerTest.test_authentication_via_kwargs ....... skip
30:   proton_tests.common.Skipped: Can't Test Extended SASL: Couldn't create auth db
30: proton_tests.reactor.ContainerTest.test_authentication_via_url .......... skip
30:   proton_tests.common.Skipped: Can't Test Extended SASL: Couldn't create auth db
30: proton_tests.reactor.ContainerTest.test_event_has_container_attribute ... skip
30:   proton_tests.common.Skipped: Can't Test Extended SASL: Couldn't create auth db
30: proton_tests.reactor.ContainerTest.test_failover ........................ pass
30: proton_tests.reactor.ContainerTest.test_failover_fail ................... fail
30: Error during test:  Traceback (most recent call last):
30:     File "/Users/runner/work/qpid-proton/qpid-proton/python/tests/proton_tests/main.py", line 389, in run
30:       phase()
30:     File "/Users/runner/work/qpid-proton/qpid-proton/python/tests/proton_tests/reactor.py", line 576, in test_failover_fail
30:       container.run()
30:     File "/Users/runner/work/qpid-proton/qpid-proton/BLD/python/.tox/py36/lib/python3.6/site-packages/proton/_reactor.py", line 183, in run
30:       while self.process():
30:     File "/Users/runner/work/qpid-proton/qpid-proton/BLD/python/.tox/py36/lib/python3.6/site-packages/proton/_reactor.py", line 243, in process
30:       event.dispatch(self._global_handler)
30:     File "/Users/runner/work/qpid-proton/qpid-proton/BLD/python/.tox/py36/lib/python3.6/site-packages/proton/_events.py", line 162, in dispatch
30:       _dispatch(handler, type.method, self)
30:     File "/Users/runner/work/qpid-proton/qpid-proton/BLD/python/.tox/py36/lib/python3.6/site-packages/proton/_events.py", line 125, in _dispatch
30:       handler.on_unhandled(method, *args)
30:     File "/Users/runner/work/qpid-proton/qpid-proton/BLD/python/.tox/py36/lib/python3.6/site-packages/proton/_reactor.py", line 874, in on_unhandled
30:       event.dispatch(self.base)
30:     File "/Users/runner/work/qpid-proton/qpid-proton/BLD/python/.tox/py36/lib/python3.6/site-packages/proton/_events.py", line 162, in dispatch
30:       _dispatch(handler, type.method, self)
30:     File "/Users/runner/work/qpid-proton/qpid-proton/BLD/python/.tox/py36/lib/python3.6/site-packages/proton/_events.py", line 123, in _dispatch
30:       m(*args)
30:     File "/Users/runner/work/qpid-proton/qpid-proton/BLD/python/.tox/py36/lib/python3.6/site-packages/proton/_handlers.py", line 1221, in on_reactor_quiesced
30:       s.writable()
30:     File "/Users/runner/work/qpid-proton/qpid-proton/BLD/python/.tox/py36/lib/python3.6/site-packages/proton/_handlers.py", line 1429, in writable
30:       sock = IO.connect(self._addrs[0])
30:     File "/Users/runner/work/qpid-proton/qpid-proton/BLD/python/.tox/py36/lib/python3.6/site-packages/proton/_io.py", line 63, in connect
30:       s.connect(addr[4])
30:   OSError: [Errno 22] Invalid argument
30: proton_tests.reactor.ContainerTest.test_failover_fail_custom_reconnect .. pass
30: proton_tests.reactor.ContainerTest.test_no_virtual_host ................. pass
30: proton_tests.reactor.ContainerTest.test_non_numeric_hostname ............ skip
30:   proton_tests.common.Skipped: Can't Test Extended SASL: Couldn't create auth db
30: proton_tests.reactor.ContainerTest.test_not_reconnecting ................ pass
30: proton_tests.reactor.ContainerTest.test_numeric_hostname ................ skip
30:   proton_tests.common.Skipped: Can't Test Extended SASL: Couldn't create auth db
30: proton_tests.reactor.ContainerTest.test_reconnect ....................... pass
30: proton_tests.reactor.ContainerTest.test_virtual_host .................... skip
30:   proton_tests.common.Skipped: Can't Test Extended SASL: Couldn't create auth db
30: proton_tests.reactor.ExceptionTest.test_connection ...................... pass
30: proton_tests.reactor.ExceptionTest.test_connection_add .................. pass
30: proton_tests.reactor.ExceptionTest.test_connection_set .................. pass
30: proton_tests.reactor.ExceptionTest.test_global_add ...................... pass
30: proton_tests.reactor.ExceptionTest.test_global_set ...................... pass
30: proton_tests.reactor.ExceptionTest.test_link_add ........................ pass
30: proton_tests.reactor.ExceptionTest.test_link_set ........................ pass
30: proton_tests.reactor.ExceptionTest.test_reactor_add ..................... pass
30: proton_tests.reactor.ExceptionTest.test_reactor_final ................... pass
30: proton_tests.reactor.ExceptionTest.test_reactor_set ..................... pass
30: proton_tests.reactor.ExceptionTest.test_schedule ........................ pass
30: proton_tests.reactor.ExceptionTest.test_schedule_cancel ................. pass
30: proton_tests.reactor.ExceptionTest.test_schedule_cancel_many ............ pass
30: proton_tests.reactor.ExceptionTest.test_schedule_event .................. pass
30: proton_tests.reactor.ExceptionTest.test_schedule_many_nothing_refs ...... pass
30: proton_tests.reactor.ExceptionTest. \
30:     test_schedule_many_nothing_refs_cancel_before_run ................... pass
30: proton_tests.reactor.ExceptionTest.test_schedule_many_nothings .......... pass
30: proton_tests.reactor.ExceptionTest.test_session_add ..................... pass
30: proton_tests.reactor.ExceptionTest.test_session_set ..................... pass
30: proton_tests.reactor.SelectorTest.test_non_unicode_selector ............. pass
30: proton_tests.reactor.SelectorTest.test_unicode_selector ................. pass
30: proton_tests.sasl.SASLEventTest.testDisallowedMechClient ................ pass
30: proton_tests.sasl.SASLEventTest.testDisallowedMechServer ................ pass
30: proton_tests.sasl.SASLEventTest.testDisallowedPlainClient ............... pass
30: proton_tests.sasl.SASLEventTest.testDisallowedPlainServer ............... pass
30: proton_tests.sasl.SASLEventTest.testFailedAuthenticationClient .......... skip
30:   proton_tests.common.Skipped: Can't Test Extended SASL: Couldn't create auth db
30: proton_tests.sasl.SASLEventTest.testFailedAuthenticationServer .......... skip
30:   proton_tests.common.Skipped: Can't Test Extended SASL: Couldn't create auth db
30: proton_tests.sasl.SASLEventTest.testNoMechClient ........................ skip
30:   proton_tests.common.Skipped: Can't Test Extended SASL: Couldn't create auth db
30: proton_tests.sasl.SASLEventTest.testNoMechServer ........................ skip
30:   proton_tests.common.Skipped: Can't Test Extended SASL: Couldn't create auth db
30: proton_tests.sasl.SASLEventTest.testNormalAuthenticationClient .......... skip
30:   proton_tests.common.Skipped: Can't Test Extended SASL: Couldn't create auth db
30: proton_tests.sasl.SASLEventTest.testNormalAuthenticationServer .......... skip
30:   proton_tests.common.Skipped: Can't Test Extended SASL: Couldn't create auth db
30: proton_tests.sasl.SASLMechTest.testANON ................................. pass
30: proton_tests.sasl.SASLMechTest.testCRAMMD5 .............................. skip
30:   proton_tests.common.Skipped: Can't Test Extended SASL: Couldn't create auth db
30: proton_tests.sasl.SASLMechTest.testDIGESTMD5 ............................ skip
30:   proton_tests.common.Skipped: Can't Test Extended SASL: Couldn't create auth db
30: proton_tests.sasl.SASLMechTest.testPLAIN ................................ skip
30:   proton_tests.common.Skipped: Can't Test Extended SASL: Couldn't create auth db
30: proton_tests.sasl.SASLMechTest.testPLAINClientFail ...................... skip
30:   proton_tests.common.Skipped: Can't Test Extended SASL: Couldn't create auth db
30: proton_tests.sasl.SASLMechTest.testPLAINfail ............................ skip
30:   proton_tests.common.Skipped: Can't Test Extended SASL: Couldn't create auth db
30: proton_tests.sasl.SSLSASLTest.testSSLExternalAuthzid .................... pass
30: proton_tests.sasl.SSLSASLTest.testSSLExternalSimple ..................... pass
30: proton_tests.sasl.SSLSASLTest.testSSLExternalSimpleFail ................. pass
30: proton_tests.sasl.SSLSASLTest.testSSLPlainAuthzid ....................... skip
30:   proton_tests.common.Skipped: Can't Test Extended SASL: Couldn't create auth db
30: proton_tests.sasl.SSLSASLTest.testSSLPlainSimple ........................ skip
30:   proton_tests.common.Skipped: Can't Test Extended SASL: Couldn't create auth db
30: proton_tests.sasl.SSLSASLTest.testSSLPlainSimpleFail .................... skip
30:   proton_tests.common.Skipped: Can't Test Extended SASL: Couldn't create auth db
30: proton_tests.sasl.SaslTest.testFracturedSASL ............................ pass
30: proton_tests.sasl.SaslTest.testIllegalProtocolLayering .................. pass
30: proton_tests.sasl.SaslTest.testMechNotFound ............................. pass
30: proton_tests.sasl.SaslTest.testPipelined2 ............................... pass
30: proton_tests.sasl.SaslTest.testPipelinedClient .......................... pass
30: proton_tests.sasl.SaslTest.testPipelinedServer .......................... pass
30: proton_tests.sasl.SaslTest.testSaslSkipped .............................. pass
30: proton_tests.sasl.SaslTest.testSaslSkippedFail .......................... pass
30: proton_tests.sasl.SaslTest.test_singleton ............................... pass
30: proton_tests.ssl.SslTest. \
30:     test_allow_unsecured_client_which_connects_secured .................. pass
30: proton_tests.ssl.SslTest. \
30:     test_allow_unsecured_client_which_connects_unsecured ................ pass
30: proton_tests.ssl.SslTest.test_bad_server_certificate .................... pass
30: proton_tests.ssl.SslTest.test_certificate_fingerprint_and_subfields ..... pass
30: proton_tests.ssl.SslTest.test_client_authentication ..................... pass
30: proton_tests.ssl.SslTest.test_client_authentication_fail_bad_cert ....... pass
30: proton_tests.ssl.SslTest.test_client_authentication_fail_no_cert ........ pass
30: proton_tests.ssl.SslTest.test_client_server_authentication .............. pass
30: proton_tests.ssl.SslTest.test_defaults .................................. pass
30: proton_tests.ssl.SslTest.test_defaults_messenger_app .................... pass
30: proton_tests.ssl.SslTest.test_disallow_unsecured_client ................. pass
30: proton_tests.ssl.SslTest.test_multiple_sessions ......................... pass
30: proton_tests.ssl.SslTest.test_server_authentication ..................... pass
30: proton_tests.ssl.SslTest.test_server_authentication_messenger_app ....... pass
30: proton_tests.ssl.SslTest.test_server_certificate ........................ pass
30: proton_tests.ssl.SslTest.test_server_hostname_authentication ............ pass
30: proton_tests.ssl.SslTest.test_server_hostname_authentication_2 .......... pass
30: proton_tests.ssl.SslTest.test_server_only_authentication ................ pass
30: proton_tests.ssl.SslTest.test_session_resume ............................ pass
30: proton_tests.ssl.SslTest.test_singleton ................................. pass
30: proton_tests.ssl.SslTest.test_ssl_with_small_buffer ..................... pass
30: proton_tests.transport.ClientTransportTest.testBigGarbage ............... pass
30: proton_tests.transport.ClientTransportTest.testBindAfterOpen ............ pass
30: proton_tests.transport.ClientTransportTest.testCloseHead ................ pass
30: proton_tests.transport.ClientTransportTest.testCloseTail ................ pass
30: proton_tests.transport.ClientTransportTest.testEOS ...................... pass
30: proton_tests.transport.ClientTransportTest.testGarbage .................. pass
30: proton_tests.transport.ClientTransportTest.testHeader ................... pass
30: proton_tests.transport.ClientTransportTest.testHeaderBadDOFF1 ........... pass
30: proton_tests.transport.ClientTransportTest.testHeaderBadDOFF2 ........... pass
30: proton_tests.transport.ClientTransportTest.testHeaderBadSize ............ pass
30: proton_tests.transport.ClientTransportTest.testPartial .................. pass
30: proton_tests.transport.ClientTransportTest.testPeek ..................... pass
30: proton_tests.transport.ClientTransportTest.testProtocolNotSupported ..... pass
30: proton_tests.transport.ClientTransportTest.testSmallGarbage ............. pass
30: proton_tests.transport.ClientTransportTest.testUnpairedPop .............. pass
30: proton_tests.transport.LogTest.testTracer ............................... pass
30: proton_tests.transport.ServerTransportTest.testBigGarbage ............... pass
30: proton_tests.transport.ServerTransportTest.testBindAfterOpen ............ pass
30: proton_tests.transport.ServerTransportTest.testCloseHead ................ pass
30: proton_tests.transport.ServerTransportTest.testCloseTail ................ pass
30: proton_tests.transport.ServerTransportTest.testEOS ...................... pass
30: proton_tests.transport.ServerTransportTest.testEOSAfterSASL ............. pass
30: proton_tests.transport.ServerTransportTest.testGarbage .................. pass
30: proton_tests.transport.ServerTransportTest.testHeader ................... pass
30: proton_tests.transport.ServerTransportTest.testPartial .................. pass
30: proton_tests.transport.ServerTransportTest.testPeek ..................... pass
30: proton_tests.transport.ServerTransportTest.testProtocolNotSupported ..... pass
30: proton_tests.transport.ServerTransportTest.testSmallGarbage ............. pass
30: proton_tests.transport.ServerTransportTest.testUnpairedPop .............. pass
30: proton_tests.url.UrlTest.testAmqps ...................................... pass
30: proton_tests.url.UrlTest.testArgs ....................................... pass
30: proton_tests.url.UrlTest.testDefaults ................................... pass
30: proton_tests.url.UrlTest.testEqual ...................................... pass
30: proton_tests.url.UrlTest.testIpV6Url .................................... pass
30: proton_tests.url.UrlTest.testMissing .................................... pass
30: proton_tests.url.UrlTest.testPort ....................................... pass
30: proton_tests.url.UrlTest.testUrl ........................................ pass
30: proton_tests.utils.SyncRequestResponseTest.test_allowed_mechs_anonymous . pass
30: proton_tests.utils.SyncRequestResponseTest.test_allowed_mechs_external .. pass
30: proton_tests.utils.SyncRequestResponseTest.test_connection_properties ... skip
30:   proton_tests.common.Skipped: Can't Test Extended SASL: Couldn't create auth db
30: proton_tests.utils.SyncRequestResponseTest.test_request_response ........ skip
30:   proton_tests.common.Skipped: Can't Test Extended SASL: Couldn't create auth db
30: Totals: 357 tests, 318 passed, 29 skipped, 9 ignored, 1 failed
30: ERROR: InvocationError for command /Users/runner/work/qpid-proton/qpid-proton/BLD/python/.tox/py36/bin/python /Users/runner/work/qpid-proton/qpid-proton/python/tests/proton-test --ignore-file /Users/runner/work/qpid-proton/qpid-proton/python/tests/tox-blacklist (exited with code 1)
30: py37 create: /Users/runner/work/qpid-proton/qpid-proton/BLD/python/.tox/py37
30: SKIPPED: InterpreterNotFound: python3.7
30: py38 create: /Users/runner/work/qpid-proton/qpid-proton/BLD/python/.tox/py38
30: SKIPPED: InterpreterNotFound: python3.8
30: ___________________________________ summary ____________________________________
30:   pep8: commands succeeded
30: ERROR:   py27: InvocationError for command /Users/runner/work/qpid-proton/qpid-proton/BLD/python/.tox/py27/bin/python -m pip install --exists-action w .tox/.tmp/package/1/python-qpid-proton-0.34.0.zip (exited with code 1)
30: SKIPPED:  py35: InterpreterNotFound: python3.5
30: ERROR:   py36: commands failed
30: SKIPPED:  py37: InterpreterNotFound: python3.7
30: SKIPPED:  py38: InterpreterNotFound: python3.8
30/33 Test #30: python-tox-test ..................***Failed  Error regular expression found in output. Regex=[ERROR:.*commands failed] 86.82 sec
{noformat})

> Apply autofixes to resolve some flake8 code formatting issues
> -------------------------------------------------------------
>
>                 Key: DISPATCH-1814
>                 URL: https://issues.apache.org/jira/browse/DISPATCH-1814
>             Project: Qpid Dispatch
>          Issue Type: Task
>    Affects Versions: 1.14.0
>            Reporter: Jiri Daněk
>            Assignee: Jiri Daněk
>            Priority: Trivial
>             Fix For: 1.16.0
>
>
> The general strategy for dealing with these in a scalable manner could be as follows
> Identify warning we want to resolve, e.g. E701 multiple statements on a single line.
> Remove E701 from flake8 ignore list in {{tests/tox.ini.in}}.
> Run the autofixer
> {code}
> pip install autopep8
> for f in `find -name "*.py"`; do autopep8 --in-place --select=E701 $f; done
> for f in `find tests -name "*.py.in"`; do autopep8 --in-place --select=E701 $f; done
> autopep8 --in-place --select=E701 tools/*.in
> {code}
> Wait about two minutes.
> Review the diffs produced.
> Submit a change request.



--
This message was sent by Atlassian Jira
(v8.3.4#803005)

---------------------------------------------------------------------
To unsubscribe, e-mail: [hidden email]
For additional commands, e-mail: [hidden email]